=> Bootstrap dependency digest>=20211023: found digest-20220214
===> Skipping vulnerability checks.
WARNING: No /usr/pkg/pkgdb/pkg-vulnerabilities file found.
WARNING: To fix run: `/usr/sbin/pkg_admin -K /usr/pkg/pkgdb fetch-pkg-vulnerabilities'.
===> Building for atheme-7.2.12
echo '#define SERNO "7.2.12-pkgsrc"' > /tmp/pkgbuild/chat/atheme/work.vax/atheme-services-v7.2.12/include/serno.h
gmake[1]: Entering directory '/tmp/pkgbuild/chat/atheme/work.vax/atheme-services-v7.2.12/include'
Generate: hooktypes.h
Generate: instpaths.h
gmake[1]: Leaving directory '/tmp/pkgbuild/chat/atheme/work.vax/atheme-services-v7.2.12/include'
gmake[1]: Entering directory '/tmp/pkgbuild/chat/atheme/work.vax/atheme-services-v7.2.12/libathemecore'
CompileLib: account.lib.o
distcc[1513] (dcc_select_for_write) ERROR: IO timeout
distcc[1513] ERROR: timeout while connecting to 10.0.20.124:3632
distcc[1513] Warning: failed to distribute account.c to 10.0.20.124:3632, running locally instead
CompileLib: atheme.lib.o
distcc[8404] (dcc_select_for_write) ERROR: IO timeout
distcc[8404] ERROR: timeout while connecting to 10.0.20.124:3632
distcc[8404] Warning: failed to distribute atheme.c to 10.0.20.124:3632, running locally instead
CompileLib: arc4random.lib.o
distcc[29265] (dcc_build_somewhere) Warning: failed to distribute, running locally instead
CompileLib: auth.lib.o
distcc[24683] (dcc_build_somewhere) Warning: failed to distribute, running locally instead
CompileLib: authcookie.lib.o
distcc[21752] (dcc_select_for_write) ERROR: IO timeout
distcc[21752] ERROR: timeout while connecting to 10.0.20.124:3632
distcc[21752] Warning: failed to distribute authcookie.c to 10.0.20.124:3632, running locally instead
CompileLib: base64.lib.o
distcc[20153] (dcc_build_somewhere) Warning: failed to distribute, running locally instead
CompileLib: channels.lib.o
distcc[9086] (dcc_build_somewhere) Warning: failed to distribute, running locally instead
CompileLib: cidr.lib.o
distcc[17429] (dcc_select_for_write) ERROR: IO timeout
distcc[17429] ERROR: timeout while connecting to 10.0.20.124:3632
distcc[17429] Warning: failed to distribute cidr.c to 10.0.20.124:3632, running locally instead
CompileLib: cmode.lib.o
distcc[2905] (dcc_build_somewhere) Warning: failed to distribute, running locally instead
CompileLib: commandtree.lib.o
distcc[25972] (dcc_select_for_write) ERROR: IO timeout
distcc[25972] ERROR: timeout while connecting to 10.0.20.124:3632
distcc[25972] Warning: failed to distribute commandtree.c to 10.0.20.124:3632, running locally instead
CompileLib: ctcp-common.lib.o
distcc[3348] (dcc_build_somewhere) Warning: failed to distribute, running locally instead
CompileLib: conf.lib.o
distcc[10182] (dcc_build_somewhere) Warning: failed to distribute, running locally instead
CompileLib: confprocess.lib.o
distcc[546] (dcc_select_for_write) ERROR: IO timeout
distcc[546] ERROR: timeout while connecting to 10.0.20.124:3632
distcc[546] Warning: failed to distribute confprocess.c to 10.0.20.124:3632, running locally instead
CompileLib: connection.lib.o
distcc[20716] (dcc_build_somewhere) Warning: failed to distribute, running locally instead
CompileLib: crypto.lib.o
distcc[4988] (dcc_select_for_write) ERROR: IO timeout
distcc[4988] ERROR: timeout while connecting to 10.0.20.124:3632
distcc[4988] Warning: failed to distribute crypto.c to 10.0.20.124:3632, running locally instead
CompileLib: culture.lib.o
distcc[1641] (dcc_build_somewhere) Warning: failed to distribute, running locally instead
CompileLib: database_backend.lib.o
distcc[5994] (dcc_build_somewhere) Warning: failed to distribute, running locally instead
CompileLib: datastream.lib.o
distcc[25973] (dcc_select_for_write) ERROR: IO timeout
distcc[25973] ERROR: timeout while connecting to 10.0.20.124:3632
distcc[25973] Warning: failed to distribute datastream.c to 10.0.20.124:3632, running locally instead
CompileLib: entity.lib.o
distcc[24811] (dcc_build_somewhere) Warning: failed to distribute, running locally instead
CompileLib: explicit_bzero.lib.o
distcc[1638] (dcc_build_somewhere) Warning: failed to distribute, running locally instead
CompileLib: flags.lib.o
distcc[20281] (dcc_select_for_write) ERROR: IO timeout
distcc[20281] ERROR: timeout while connecting to 10.0.20.124:3632
distcc[20281] Warning: failed to distribute flags.c to 10.0.20.124:3632, running locally instead
CompileLib: function.lib.o
distcc[3697] (dcc_select_for_write) ERROR: IO timeout
distcc[3697] ERROR: timeout while connecting to 10.0.20.124:3632
distcc[3697] Warning: failed to distribute function.c to 10.0.20.124:3632, running locally instead
CompileLib: help.lib.o
distcc[11322] (dcc_build_somewhere) Warning: failed to distribute, running locally instead
CompileLib: hook.lib.o
distcc[13519] (dcc_select_for_write) ERROR: IO timeout
distcc[13519] ERROR: timeout while connecting to 10.0.20.124:3632
distcc[13519] Warning: failed to distribute hook.c to 10.0.20.124:3632, running locally instead
CompileLib: linker.lib.o
distcc[16083] (dcc_build_somewhere) Warning: failed to distribute, running locally instead
CompileLib: logger.lib.o
distcc[2354] (dcc_build_somewhere) Warning: failed to distribute, running locally instead
CompileLib: match.lib.o
distcc[3154] (dcc_select_for_write) ERROR: IO timeout
distcc[3154] ERROR: timeout while connecting to 10.0.20.124:3632
distcc[3154] Warning: failed to distribute match.c to 10.0.20.124:3632, running locally instead
CompileLib: md5.lib.o
distcc[3709] (dcc_build_somewhere) Warning: failed to distribute, running locally instead
CompileLib: memory.lib.o
distcc[21341] (dcc_select_for_write) ERROR: IO timeout
distcc[21341] ERROR: timeout while connecting to 10.0.20.124:3632
distcc[21341] Warning: failed to distribute memory.c to 10.0.20.124:3632, running locally instead
CompileLib: module.lib.o
distcc[13487] (dcc_build_somewhere) Warning: failed to distribute, running locally instead
CompileLib: node.lib.o
distcc[27460] (dcc_select_for_write) ERROR: IO timeout
distcc[27460] ERROR: timeout while connecting to 10.0.20.124:3632
distcc[27460] Warning: failed to distribute node.c to 10.0.20.124:3632, running locally instead
CompileLib: object.lib.o
distcc[10519] (dcc_build_somewhere) Warning: failed to distribute, running locally instead
CompileLib: packet.lib.o
distcc[6599] (dcc_build_somewhere) Warning: failed to distribute, running locally instead
CompileLib: phandler.lib.o
distcc[10924] (dcc_select_for_write) ERROR: IO timeout
distcc[10924] ERROR: timeout while connecting to 10.0.20.124:3632
distcc[10924] Warning: failed to distribute phandler.c to 10.0.20.124:3632, running locally instead
CompileLib: pmodule.lib.o
distcc[9342] (dcc_build_somewhere) Warning: failed to distribute, running locally instead
CompileLib: privs.lib.o
distcc[20409] (dcc_build_somewhere) Warning: failed to distribute, running locally instead
CompileLib: ptasks.lib.o
distcc[792] (dcc_select_for_write) ERROR: IO timeout
distcc[792] ERROR: timeout while connecting to 10.0.20.124:3632
distcc[792] Warning: failed to distribute ptasks.c to 10.0.20.124:3632, running locally instead
CompileLib: res.lib.o
distcc[11450] (dcc_build_somewhere) Warning: failed to distribute, running locally instead
CompileLib: reslib.lib.o
distcc[13647] (dcc_select_for_write) ERROR: IO timeout
distcc[13647] ERROR: timeout while connecting to 10.0.20.124:3632
distcc[13647] Warning: failed to distribute reslib.c to 10.0.20.124:3632, running locally instead
CompileLib: qrcode.lib.o
distcc[12107] (dcc_build_somewhere) Warning: failed to distribute, running locally instead
CompileLib: send.lib.o
distcc[802] (dcc_select_for_write) ERROR: IO timeout
distcc[802] ERROR: timeout while connecting to 10.0.20.124:3632
distcc[802] Warning: failed to distribute send.c to 10.0.20.124:3632, running locally instead
CompileLib: servers.lib.o
distcc[21186] (dcc_build_somewhere) Warning: failed to distribute, running locally instead
CompileLib: services.lib.o
distcc[5244] (dcc_build_somewhere) Warning: failed to distribute, running locally instead
CompileLib: servtree.lib.o
distcc[21469] (dcc_select_for_write) ERROR: IO timeout
distcc[21469] ERROR: timeout while connecting to 10.0.20.124:3632
distcc[21469] Warning: failed to distribute servtree.c to 10.0.20.124:3632, running locally instead
CompileLib: sharedheap.lib.o
distcc[20165] (dcc_build_somewhere) Warning: failed to distribute, running locally instead
CompileLib: signal.lib.o
distcc[27588] (dcc_build_somewhere) Warning: failed to distribute, running locally instead
CompileLib: snprintf.lib.o
distcc[10647] (dcc_select_for_write) ERROR: IO timeout
distcc[10647] ERROR: timeout while connecting to 10.0.20.124:3632
distcc[10647] Warning: failed to distribute snprintf.c to 10.0.20.124:3632, running locally instead
CompileLib: string.lib.o
distcc[1894] (dcc_build_somewhere) Warning: failed to distribute, running locally instead
CompileLib: strshare.lib.o
distcc[11052] (dcc_build_somewhere) Warning: failed to distribute, running locally instead
CompileLib: svsignore.lib.o
distcc[9470] (dcc_build_somewhere) Warning: failed to distribute, running locally instead
CompileLib: table.lib.o
distcc[20537] (dcc_select_for_write) ERROR: IO timeout
distcc[20537] ERROR: timeout while connecting to 10.0.20.124:3632
distcc[20537] Warning: failed to distribute table.c to 10.0.20.124:3632, running locally instead
CompileLib: template.lib.o
distcc[920] (dcc_build_somewhere) Warning: failed to distribute, running locally instead
CompileLib: tokenize.lib.o
distcc[423] (dcc_build_somewhere) Warning: failed to distribute, running locally instead
CompileLib: ubase64.lib.o
distcc[16339] (dcc_select_for_write) ERROR: IO timeout
distcc[16339] ERROR: timeout while connecting to 10.0.20.124:3632
distcc[16339] Warning: failed to distribute ubase64.c to 10.0.20.124:3632, running locally instead
CompileLib: users.lib.o
distcc[3544] (dcc_build_somewhere) Warning: failed to distribute, running locally instead
CompileLib: uid.lib.o
distcc[3410] (dcc_build_somewhere) Warning: failed to distribute, running locally instead
CompileLib: uplink.lib.o
distcc[930] (dcc_select_for_write) ERROR: IO timeout
distcc[930] ERROR: timeout while connecting to 10.0.20.124:3632
distcc[930] Warning: failed to distribute uplink.c to 10.0.20.124:3632, running locally instead
CompileLib: version.lib.o
distcc[4840] (dcc_build_somewhere) Warning: failed to distribute, running locally instead
Link: libathemecore.so
gmake[1]: Leaving directory '/tmp/pkgbuild/chat/atheme/work.vax/atheme-services-v7.2.12/libathemecore'
gmake[1]: Entering directory '/tmp/pkgbuild/chat/atheme/work.vax/atheme-services-v7.2.12/modules'
gmake[2]: Entering directory '/tmp/pkgbuild/chat/atheme/work.vax/atheme-services-v7.2.12/modules/alis'
CompileModule: main.so
gmake[2]: Leaving directory '/tmp/pkgbuild/chat/atheme/work.vax/atheme-services-v7.2.12/modules/alis'
gmake[2]: Entering directory '/tmp/pkgbuild/chat/atheme/work.vax/atheme-services-v7.2.12/modules/auth'
CompileModule: dummy.so
gmake[2]: Leaving directory '/tmp/pkgbuild/chat/atheme/work.vax/atheme-services-v7.2.12/modules/auth'
gmake[2]: Entering directory '/tmp/pkgbuild/chat/atheme/work.vax/atheme-services-v7.2.12/modules/backend'
CompileModule: flatfile.so
CompileModule: corestorage.so
CompileModule: opensex.so
gmake[2]: Leaving directory '/tmp/pkgbuild/chat/atheme/work.vax/atheme-services-v7.2.12/modules/backend'
gmake[2]: Entering directory '/tmp/pkgbuild/chat/atheme/work.vax/atheme-services-v7.2.12/modules/botserv'
CompileModule: main.so
CompileModule: bottalk.so
CompileModule: help.so
CompileModule: info.so
CompileModule: set.so
CompileModule: set_core.so
CompileModule: set_fantasy.so
CompileModule: set_nobot.so
CompileModule: set_private.so
CompileModule: set_saycaller.so
gmake[2]: Leaving directory '/tmp/pkgbuild/chat/atheme/work.vax/atheme-services-v7.2.12/modules/botserv'
gmake[2]: Entering directory '/tmp/pkgbuild/chat/atheme/work.vax/atheme-services-v7.2.12/modules/chanfix'
CompilePlugin: main.plugin.o
distcc[2150] (dcc_select_for_write) ERROR: IO timeout
distcc[2150] ERROR: timeout while connecting to 10.0.20.124:3632
distcc[2150] Warning: failed to distribute main.c to 10.0.20.124:3632, running locally instead
CompilePlugin: gather.plugin.o
distcc[18069] (dcc_build_somewhere) Warning: failed to distribute, running locally instead
CompilePlugin: fix.plugin.o
distcc[26971] (dcc_build_somewhere) Warning: failed to distribute, running locally instead
Link: main.so
gmake[2]: Leaving directory '/tmp/pkgbuild/chat/atheme/work.vax/atheme-services-v7.2.12/modules/chanfix'
gmake[2]: Entering directory '/tmp/pkgbuild/chat/atheme/work.vax/atheme-services-v7.2.12/modules/chanserv'
CompileModule: main.so
CompileModule: access.so
CompileModule: akick.so
CompileModule: antiflood.so
CompileModule: ban.so
CompileModule: clear.so
CompileModule: clear_akicks.so
CompileModule: clear_bans.so
CompileModule: clear_flags.so
CompileModule: clear_users.so
CompileModule: clone.so
CompileModule: close.so
CompileModule: count.so
CompileModule: drop.so
CompileModule: fflags.so
CompileModule: flags.so
CompileModule: ftransfer.so
CompileModule: getkey.so
CompileModule: halfop.so
CompileModule: help.so
help.c: In function 'cs_cmd_help':
help.c:69:71: warning: comparison between pointer and zero character constant [-Wpointer-compare]
   69 |   if (chansvs.fantasy && config_options.join_chans && chansvs.trigger != '\0')
      |                                                                       ^~
help.c:69:55: note: did you mean to dereference the pointer?
   69 |   if (chansvs.fantasy && config_options.join_chans && chansvs.trigger != '\0')
      |                                                       ^
CompileModule: hold.so
CompileModule: info.so
CompileModule: invite.so
CompileModule: kick.so
CompileModule: list.so
CompileModule: mark.so
CompileModule: moderate.so
CompileModule: op.so
CompileModule: owner.so
CompileModule: protect.so
CompileModule: quiet.so
CompileModule: recover.so
CompileModule: register.so
CompileModule: set.so
CompileModule: set_core.so
CompileModule: set_email.so
CompileModule: set_entrymsg.so
CompileModule: set_fantasy.so
CompileModule: set_gameserv.so
CompileModule: set_guard.so
CompileModule: set_keeptopic.so
CompileModule: set_limitflags.so
CompileModule: set_mlock.so
CompileModule: set_prefix.so
CompileModule: set_private.so
CompileModule: set_property.so
CompileModule: set_pubacl.so
CompileModule: set_restricted.so
CompileModule: set_secure.so
CompileModule: set_topiclock.so
CompileModule: set_url.so
CompileModule: set_verbose.so
CompileModule: successor_acl.so
CompileModule: status.so
CompileModule: sync.so
CompileModule: taxonomy.so
CompileModule: template.so
CompileModule: topic.so
CompileModule: unban_self.so
CompileModule: version.so
CompileModule: voice.so
CompileModule: why.so
CompileModule: xop.so
gmake[2]: Leaving directory '/tmp/pkgbuild/chat/atheme/work.vax/atheme-services-v7.2.12/modules/chanserv'
gmake[2]: Entering directory '/tmp/pkgbuild/chat/atheme/work.vax/atheme-services-v7.2.12/modules/crypto'
CompileModule: argon2d.so
during RTL pass: postreload
argon2d.c: In function 'blake2b_compress':
argon2d.c:314:1: internal compiler error: in cselib_invalidate_regno, at cselib.c:2422
  314 | }
      | ^
no stack trace because unwind library not available
Please submit a full bug report,
with preprocessed source if appropriate.
See <http://www.NetBSD.org/support/send-pr.html> for instructions.
distcc[8663] ERROR: compile argon2d.c on localhost failed
gmake[2]: *** [../../buildsys.module.mk:16: argon2d.so] Error 1
gmake[2]: Leaving directory '/tmp/pkgbuild/chat/atheme/work.vax/atheme-services-v7.2.12/modules/crypto'
gmake[1]: *** [../buildsys.mk:120: crypto] Error 2
gmake[1]: Leaving directory '/tmp/pkgbuild/chat/atheme/work.vax/atheme-services-v7.2.12/modules'
gmake: *** [buildsys.mk:120: modules] Error 2
*** Error code 2

Stop.
make[1]: stopped in /usr/pkgsrc/chat/atheme
*** Error code 1

Stop.
make: stopped in /usr/pkgsrc/chat/atheme