=> Bootstrap dependency digest>=20211023: found digest-20220214
===> Skipping vulnerability checks.
WARNING: No /usr/pkg/pkgdb/pkg-vulnerabilities file found.
WARNING: To fix run: `/usr/sbin/pkg_admin -K /usr/pkg/pkgdb fetch-pkg-vulnerabilities'.
===> Building for lua53-cqueues-20200726
gmake -f GNUmakefile all5.3
gmake[1]: Entering directory '/tmp/pkgbuild/devel/lua-cqueues/work.vax/cqueues-rel-20200726'
cp /tmp/pkgbuild/devel/lua-cqueues/work.vax/cqueues-rel-20200726/config.h.guess /tmp/pkgbuild/devel/lua-cqueues/work.vax/cqueues-rel-20200726/config.h
cp /tmp/pkgbuild/devel/lua-cqueues/work.vax/cqueues-rel-20200726/config.h /tmp/pkgbuild/devel/lua-cqueues/work.vax/cqueues-rel-20200726/src/config.h
mkdir -p /tmp/pkgbuild/devel/lua-cqueues/work.vax/cqueues-rel-20200726/src/5.3
gcc -O2 -std=gnu99 -fPIC -g -Wall -Wextra  -Wno-missing-field-initializers  -Wno-override-init -Wno-unused -O2 -D_FORTIFY_SOURCE=2 -I/usr/pkg/include/lua-5.3 -I/usr/include/readline -I/usr/include -DLUA_COMPAT_APIINTCASTS  -D_REENTRANT -D_THREAD_SAFE -D_GNU_SOURCE -I/usr/pkg/include/lua-5.3 -I/usr/include/readline -I/usr/include -DCOMPAT53_PREFIX=cqueues -DCQUEUES_VENDOR='"quae@daurnimator.com"' -DCQUEUES_VERSION=20200726L  -c -o /tmp/pkgbuild/devel/lua-cqueues/work.vax/cqueues-rel-20200726/src/5.3/cqueues.o /tmp/pkgbuild/devel/lua-cqueues/work.vax/cqueues-rel-20200726/src/cqueues.c
distcc[12859] ERROR: compile /tmp/pkgbuild/devel/lua-cqueues/work.vax/cqueues-rel-20200726/src/cqueues.c on 10.0.20.124:3632 failed
distcc[12859] (dcc_build_somewhere) Warning: remote compilation of '/tmp/pkgbuild/devel/lua-cqueues/work.vax/cqueues-rel-20200726/src/cqueues.c' failed, retrying locally
distcc[12859] Warning: failed to distribute /tmp/pkgbuild/devel/lua-cqueues/work.vax/cqueues-rel-20200726/src/cqueues.c to 10.0.20.124:3632, running locally instead
/tmp/pkgbuild/devel/lua-cqueues/work.vax/cqueues-rel-20200726/src/cqueues.c: In function 'abstimeout':
/tmp/pkgbuild/devel/lua-cqueues/work.vax/cqueues-rel-20200726/src/cqueues.c:308:62: error: 'NAN' undeclared (first use in this function)
  308 |  return (isfinite(timeout))? monotime() + fmax(timeout, 0) : NAN;
      |                                                              ^~~
/tmp/pkgbuild/devel/lua-cqueues/work.vax/cqueues-rel-20200726/src/cqueues.c:308:62: note: each undeclared identifier is reported only once for each function it appears in
/tmp/pkgbuild/devel/lua-cqueues/work.vax/cqueues-rel-20200726/src/cqueues.c: In function 'reltimeout':
/tmp/pkgbuild/devel/lua-cqueues/work.vax/cqueues-rel-20200726/src/cqueues.c:316:10: error: 'NAN' undeclared (first use in this function)
  316 |   return NAN;
      |          ^~~
/tmp/pkgbuild/devel/lua-cqueues/work.vax/cqueues-rel-20200726/src/cqueues.c: In function 'mintimeout':
/tmp/pkgbuild/devel/lua-cqueues/work.vax/cqueues-rel-20200726/src/cqueues.c:330:10: error: 'NAN' undeclared (first use in this function)
  330 |   return NAN;
      |          ^~~
/tmp/pkgbuild/devel/lua-cqueues/work.vax/cqueues-rel-20200726/src/cqueues.c: In function 'event_init':
/tmp/pkgbuild/devel/lua-cqueues/work.vax/cqueues-rel-20200726/src/cqueues.c:1769:19: error: 'NAN' undeclared (first use in this function)
 1769 |  event->timeout = NAN;
      |                   ^~~
/tmp/pkgbuild/devel/lua-cqueues/work.vax/cqueues-rel-20200726/src/cqueues.c: In function 'timer_init':
/tmp/pkgbuild/devel/lua-cqueues/work.vax/cqueues-rel-20200726/src/cqueues.c:1832:19: error: 'NAN' undeclared (first use in this function)
 1832 |  timer->timeout = NAN;
      |                   ^~~
/tmp/pkgbuild/devel/lua-cqueues/work.vax/cqueues-rel-20200726/src/cqueues.c: In function 'timer_del':
/tmp/pkgbuild/devel/lua-cqueues/work.vax/cqueues-rel-20200726/src/cqueues.c:1839:20: error: 'NAN' undeclared (first use in this function)
 1839 |   timer->timeout = NAN;
      |                    ^~~
/tmp/pkgbuild/devel/lua-cqueues/work.vax/cqueues-rel-20200726/src/cqueues.c: In function 'thread_timeout':
/tmp/pkgbuild/devel/lua-cqueues/work.vax/cqueues-rel-20200726/src/cqueues.c:1860:19: error: 'NAN' undeclared (first use in this function)
 1860 |  double timeout = NAN;
      |                   ^~~
/tmp/pkgbuild/devel/lua-cqueues/work.vax/cqueues-rel-20200726/src/cqueues.c: In function 'cqueue_timeout_':
/tmp/pkgbuild/devel/lua-cqueues/work.vax/cqueues-rel-20200726/src/cqueues.c:2201:10: error: 'NAN' undeclared (first use in this function)
 2201 |   return NAN;
      |          ^~~
/tmp/pkgbuild/devel/lua-cqueues/work.vax/cqueues-rel-20200726/src/cqueues.c: In function 'cqueue_step':
/tmp/pkgbuild/devel/lua-cqueues/work.vax/cqueues-rel-20200726/src/cqueues.c:2279:45: error: 'NAN' undeclared (first use in this function)
 2279 |   timeout = mintimeout(luaL_optnumber(L, 2, NAN), cqueue_timeout_(Q));
      |                                             ^~~
/tmp/pkgbuild/devel/lua-cqueues/work.vax/cqueues-rel-20200726/src/cqueues.c: In function 'abstimeout':
/tmp/pkgbuild/devel/lua-cqueues/work.vax/cqueues-rel-20200726/src/cqueues.c:309:1: warning: control reaches end of non-void function [-Wreturn-type]
  309 | } /* abstimeout() */
      | ^
/tmp/pkgbuild/devel/lua-cqueues/work.vax/cqueues-rel-20200726/src/cqueues.c: In function 'mintimeout':
/tmp/pkgbuild/devel/lua-cqueues/work.vax/cqueues-rel-20200726/src/cqueues.c:331:1: warning: control reaches end of non-void function [-Wreturn-type]
  331 | } /* mintimeout() */
      | ^
distcc[12859] ERROR: compile /tmp/pkgbuild/devel/lua-cqueues/work.vax/cqueues-rel-20200726/src/cqueues.c on localhost failed
gmake[1]: *** [/tmp/pkgbuild/devel/lua-cqueues/work.vax/cqueues-rel-20200726/src/GNUmakefile:88: /tmp/pkgbuild/devel/lua-cqueues/work.vax/cqueues-rel-20200726/src/5.3/cqueues.o] Error 1
gmake[1]: Leaving directory '/tmp/pkgbuild/devel/lua-cqueues/work.vax/cqueues-rel-20200726'
gmake: *** [Makefile:7: all5.3] Error 2
*** Error code 2

Stop.
make[1]: stopped in /usr/pkgsrc/devel/lua-cqueues
*** Error code 1

Stop.
make: stopped in /usr/pkgsrc/devel/lua-cqueues