=> Bootstrap dependency digest>=20211023: found digest-20220214
===> Skipping vulnerability checks.
WARNING: No /usr/pkg/pkgdb/pkg-vulnerabilities file found.
WARNING: To fix run: `/usr/sbin/pkg_admin -K /usr/pkg/pkgdb fetch-pkg-vulnerabilities'.
===> Building for xosview2-2.3.3
cd /tmp/pkgbuild/sysutils/xosview2/work.vax/xosview2-2.3.3/cmeter && /usr/bin/make
c++ -O2 -D_FORTIFY_SOURCE=2 -I/usr/pkg/include -I/usr/X11R7/include -I/usr/include -I/usr/X11R7/include/freetype2 -I/usr/pkg/include -I/usr/X11R7/include -I/usr/include -I/usr/X11R7/include/freetype2 -I/usr/X11R7/include -I/tmp/pkgbuild/sysutils/xosview2/work.vax/xosview2-2.3.3 -I/tmp/pkgbuild/sysutils/xosview2/work.vax/xosview2-2.3.3/cmeter -I/tmp/pkgbuild/sysutils/xosview2/work.vax/xosview2-2.3.3/bsd -DHAVE_CONFIG_H -c meter.cc -o meter.o
distcc[19751] ERROR: nonblocking connect to 10.0.20.124:3632 failed: Connection refused
distcc[19751] Warning: failed to distribute meter.cc to 10.0.20.124:3632, running locally instead
c++ -O2 -D_FORTIFY_SOURCE=2 -I/usr/pkg/include -I/usr/X11R7/include -I/usr/include -I/usr/X11R7/include/freetype2 -I/usr/pkg/include -I/usr/X11R7/include -I/usr/include -I/usr/X11R7/include/freetype2 -I/usr/X11R7/include -I/tmp/pkgbuild/sysutils/xosview2/work.vax/xosview2-2.3.3 -I/tmp/pkgbuild/sysutils/xosview2/work.vax/xosview2-2.3.3/cmeter -I/tmp/pkgbuild/sysutils/xosview2/work.vax/xosview2-2.3.3/bsd -DHAVE_CONFIG_H -c fieldmeter.cc -o fieldmeter.o
distcc[19304] ERROR: nonblocking connect to 10.0.20.124:3632 failed: Connection refused
distcc[19304] Warning: failed to distribute fieldmeter.cc to 10.0.20.124:3632, running locally instead
c++ -O2 -D_FORTIFY_SOURCE=2 -I/usr/pkg/include -I/usr/X11R7/include -I/usr/include -I/usr/X11R7/include/freetype2 -I/usr/pkg/include -I/usr/X11R7/include -I/usr/include -I/usr/X11R7/include/freetype2 -I/usr/X11R7/include -I/tmp/pkgbuild/sysutils/xosview2/work.vax/xosview2-2.3.3 -I/tmp/pkgbuild/sysutils/xosview2/work.vax/xosview2-2.3.3/cmeter -I/tmp/pkgbuild/sysutils/xosview2/work.vax/xosview2-2.3.3/bsd -DHAVE_CONFIG_H -c fieldmeterdecay.cc -o fieldmeterdecay.o
distcc[20349] ERROR: nonblocking connect to 10.0.20.124:3632 failed: Connection refused
distcc[20349] Warning: failed to distribute fieldmeterdecay.cc to 10.0.20.124:3632, running locally instead
c++ -O2 -D_FORTIFY_SOURCE=2 -I/usr/pkg/include -I/usr/X11R7/include -I/usr/include -I/usr/X11R7/include/freetype2 -I/usr/pkg/include -I/usr/X11R7/include -I/usr/include -I/usr/X11R7/include/freetype2 -I/usr/X11R7/include -I/tmp/pkgbuild/sysutils/xosview2/work.vax/xosview2-2.3.3 -I/tmp/pkgbuild/sysutils/xosview2/work.vax/xosview2-2.3.3/cmeter -I/tmp/pkgbuild/sysutils/xosview2/work.vax/xosview2-2.3.3/bsd -DHAVE_CONFIG_H -c fieldmetergraph.cc -o fieldmetergraph.o
distcc[28646] ERROR: nonblocking connect to 10.0.20.124:3632 failed: Connection refused
distcc[28646] Warning: failed to distribute fieldmetergraph.cc to 10.0.20.124:3632, running locally instead
c++ -O2 -D_FORTIFY_SOURCE=2 -I/usr/pkg/include -I/usr/X11R7/include -I/usr/include -I/usr/X11R7/include/freetype2 -I/usr/pkg/include -I/usr/X11R7/include -I/usr/include -I/usr/X11R7/include/freetype2 -I/usr/X11R7/include -I/tmp/pkgbuild/sysutils/xosview2/work.vax/xosview2-2.3.3 -I/tmp/pkgbuild/sysutils/xosview2/work.vax/xosview2-2.3.3/cmeter -I/tmp/pkgbuild/sysutils/xosview2/work.vax/xosview2-2.3.3/bsd -DHAVE_CONFIG_H -c bitmeter.cc -o bitmeter.o
distcc[23328] ERROR: nonblocking connect to 10.0.20.124:3632 failed: Connection refused
distcc[23328] Warning: failed to distribute bitmeter.cc to 10.0.20.124:3632, running locally instead
c++ -O2 -D_FORTIFY_SOURCE=2 -I/usr/pkg/include -I/usr/X11R7/include -I/usr/include -I/usr/X11R7/include/freetype2 -I/usr/pkg/include -I/usr/X11R7/include -I/usr/include -I/usr/X11R7/include/freetype2 -I/usr/X11R7/include -I/tmp/pkgbuild/sysutils/xosview2/work.vax/xosview2-2.3.3 -I/tmp/pkgbuild/sysutils/xosview2/work.vax/xosview2-2.3.3/cmeter -I/tmp/pkgbuild/sysutils/xosview2/work.vax/xosview2-2.3.3/bsd -DHAVE_CONFIG_H -c bitfieldmeter.cc -o bitfieldmeter.o
distcc[5200] ERROR: nonblocking connect to 10.0.20.124:3632 failed: Connection refused
distcc[5200] Warning: failed to distribute bitfieldmeter.cc to 10.0.20.124:3632, running locally instead
c++ -O2 -D_FORTIFY_SOURCE=2 -I/usr/pkg/include -I/usr/X11R7/include -I/usr/include -I/usr/X11R7/include/freetype2 -I/usr/pkg/include -I/usr/X11R7/include -I/usr/include -I/usr/X11R7/include/freetype2 -I/usr/X11R7/include -I/tmp/pkgbuild/sysutils/xosview2/work.vax/xosview2-2.3.3 -I/tmp/pkgbuild/sysutils/xosview2/work.vax/xosview2-2.3.3/cmeter -I/tmp/pkgbuild/sysutils/xosview2/work.vax/xosview2-2.3.3/bsd -DHAVE_CONFIG_H -c sensorfieldmeter.cc -o sensorfieldmeter.o
distcc[1814] ERROR: nonblocking connect to 10.0.20.124:3632 failed: Connection refused
distcc[1814] Warning: failed to distribute sensorfieldmeter.cc to 10.0.20.124:3632, running locally instead
c++ -O2 -D_FORTIFY_SOURCE=2 -I/usr/pkg/include -I/usr/X11R7/include -I/usr/include -I/usr/X11R7/include/freetype2 -I/usr/pkg/include -I/usr/X11R7/include -I/usr/include -I/usr/X11R7/include/freetype2 -I/usr/X11R7/include -I/tmp/pkgbuild/sysutils/xosview2/work.vax/xosview2-2.3.3 -I/tmp/pkgbuild/sysutils/xosview2/work.vax/xosview2-2.3.3/cmeter -I/tmp/pkgbuild/sysutils/xosview2/work.vax/xosview2-2.3.3/bsd -DHAVE_CONFIG_H -c cswapmeter.cc -o cswapmeter.o
distcc[29901] ERROR: nonblocking connect to 10.0.20.124:3632 failed: Connection refused
distcc[29901] Warning: failed to distribute cswapmeter.cc to 10.0.20.124:3632, running locally instead
c++ -O2 -D_FORTIFY_SOURCE=2 -I/usr/pkg/include -I/usr/X11R7/include -I/usr/include -I/usr/X11R7/include/freetype2 -I/usr/pkg/include -I/usr/X11R7/include -I/usr/include -I/usr/X11R7/include/freetype2 -I/usr/X11R7/include -I/tmp/pkgbuild/sysutils/xosview2/work.vax/xosview2-2.3.3 -I/tmp/pkgbuild/sysutils/xosview2/work.vax/xosview2-2.3.3/cmeter -I/tmp/pkgbuild/sysutils/xosview2/work.vax/xosview2-2.3.3/bsd -DHAVE_CONFIG_H -c pswapmeter.cc -o pswapmeter.o
distcc[15602] ERROR: nonblocking connect to 10.0.20.124:3632 failed: Connection refused
distcc[15602] Warning: failed to distribute pswapmeter.cc to 10.0.20.124:3632, running locally instead
c++ -O2 -D_FORTIFY_SOURCE=2 -I/usr/pkg/include -I/usr/X11R7/include -I/usr/include -I/usr/X11R7/include/freetype2 -I/usr/pkg/include -I/usr/X11R7/include -I/usr/include -I/usr/X11R7/include/freetype2 -I/usr/X11R7/include -I/tmp/pkgbuild/sysutils/xosview2/work.vax/xosview2-2.3.3 -I/tmp/pkgbuild/sysutils/xosview2/work.vax/xosview2-2.3.3/cmeter -I/tmp/pkgbuild/sysutils/xosview2/work.vax/xosview2-2.3.3/bsd -DHAVE_CONFIG_H -c cloadmeter.cc -o cloadmeter.o
distcc[16361] ERROR: nonblocking connect to 10.0.20.124:3632 failed: Connection refused
distcc[16361] Warning: failed to distribute cloadmeter.cc to 10.0.20.124:3632, running locally instead
c++ -O2 -D_FORTIFY_SOURCE=2 -I/usr/pkg/include -I/usr/X11R7/include -I/usr/include -I/usr/X11R7/include/freetype2 -I/usr/pkg/include -I/usr/X11R7/include -I/usr/include -I/usr/X11R7/include/freetype2 -I/usr/X11R7/include -I/tmp/pkgbuild/sysutils/xosview2/work.vax/xosview2-2.3.3 -I/tmp/pkgbuild/sysutils/xosview2/work.vax/xosview2-2.3.3/cmeter -I/tmp/pkgbuild/sysutils/xosview2/work.vax/xosview2-2.3.3/bsd -DHAVE_CONFIG_H -c ploadmeter.cc -o ploadmeter.o
distcc[14784] ERROR: nonblocking connect to 10.0.20.124:3632 failed: Connection refused
distcc[14784] Warning: failed to distribute ploadmeter.cc to 10.0.20.124:3632, running locally instead
c++ -O2 -D_FORTIFY_SOURCE=2 -I/usr/pkg/include -I/usr/X11R7/include -I/usr/include -I/usr/X11R7/include/freetype2 -I/usr/pkg/include -I/usr/X11R7/include -I/usr/include -I/usr/X11R7/include/freetype2 -I/usr/X11R7/include -I/tmp/pkgbuild/sysutils/xosview2/work.vax/xosview2-2.3.3 -I/tmp/pkgbuild/sysutils/xosview2/work.vax/xosview2-2.3.3/cmeter -I/tmp/pkgbuild/sysutils/xosview2/work.vax/xosview2-2.3.3/bsd -DHAVE_CONFIG_H -c pmemmeter.cc -o pmemmeter.o
distcc[23315] ERROR: nonblocking connect to 10.0.20.124:3632 failed: Connection refused
distcc[23315] Warning: failed to distribute pmemmeter.cc to 10.0.20.124:3632, running locally instead
c++ -O2 -D_FORTIFY_SOURCE=2 -I/usr/pkg/include -I/usr/X11R7/include -I/usr/include -I/usr/X11R7/include/freetype2 -I/usr/pkg/include -I/usr/X11R7/include -I/usr/include -I/usr/X11R7/include/freetype2 -I/usr/X11R7/include -I/tmp/pkgbuild/sysutils/xosview2/work.vax/xosview2-2.3.3 -I/tmp/pkgbuild/sysutils/xosview2/work.vax/xosview2-2.3.3/cmeter -I/tmp/pkgbuild/sysutils/xosview2/work.vax/xosview2-2.3.3/bsd -DHAVE_CONFIG_H -c cintratemeter.cc -o cintratemeter.o
distcc[19546] ERROR: nonblocking connect to 10.0.20.124:3632 failed: Connection refused
distcc[19546] Warning: failed to distribute cintratemeter.cc to 10.0.20.124:3632, running locally instead
c++ -O2 -D_FORTIFY_SOURCE=2 -I/usr/pkg/include -I/usr/X11R7/include -I/usr/include -I/usr/X11R7/include/freetype2 -I/usr/pkg/include -I/usr/X11R7/include -I/usr/include -I/usr/X11R7/include/freetype2 -I/usr/X11R7/include -I/tmp/pkgbuild/sysutils/xosview2/work.vax/xosview2-2.3.3 -I/tmp/pkgbuild/sysutils/xosview2/work.vax/xosview2-2.3.3/cmeter -I/tmp/pkgbuild/sysutils/xosview2/work.vax/xosview2-2.3.3/bsd -DHAVE_CONFIG_H -c pintratemeter.cc -o pintratemeter.o
distcc[29257] ERROR: nonblocking connect to 10.0.20.124:3632 failed: Connection refused
distcc[29257] Warning: failed to distribute pintratemeter.cc to 10.0.20.124:3632, running locally instead
c++ -O2 -D_FORTIFY_SOURCE=2 -I/usr/pkg/include -I/usr/X11R7/include -I/usr/include -I/usr/X11R7/include/freetype2 -I/usr/pkg/include -I/usr/X11R7/include -I/usr/include -I/usr/X11R7/include/freetype2 -I/usr/X11R7/include -I/tmp/pkgbuild/sysutils/xosview2/work.vax/xosview2-2.3.3 -I/tmp/pkgbuild/sysutils/xosview2/work.vax/xosview2-2.3.3/cmeter -I/tmp/pkgbuild/sysutils/xosview2/work.vax/xosview2-2.3.3/bsd -DHAVE_CONFIG_H -c cfsmeter.cc -o cfsmeter.o
distcc[22818] ERROR: nonblocking connect to 10.0.20.124:3632 failed: Connection refused
distcc[22818] Warning: failed to distribute cfsmeter.cc to 10.0.20.124:3632, running locally instead
c++ -O2 -D_FORTIFY_SOURCE=2 -I/usr/pkg/include -I/usr/X11R7/include -I/usr/include -I/usr/X11R7/include/freetype2 -I/usr/pkg/include -I/usr/X11R7/include -I/usr/include -I/usr/X11R7/include/freetype2 -I/usr/X11R7/include -I/tmp/pkgbuild/sysutils/xosview2/work.vax/xosview2-2.3.3 -I/tmp/pkgbuild/sysutils/xosview2/work.vax/xosview2-2.3.3/cmeter -I/tmp/pkgbuild/sysutils/xosview2/work.vax/xosview2-2.3.3/bsd -DHAVE_CONFIG_H -c cnetmeter.cc -o cnetmeter.o
distcc[23456] ERROR: nonblocking connect to 10.0.20.124:3632 failed: Connection refused
distcc[23456] Warning: failed to distribute cnetmeter.cc to 10.0.20.124:3632, running locally instead
c++ -O2 -D_FORTIFY_SOURCE=2 -I/usr/pkg/include -I/usr/X11R7/include -I/usr/include -I/usr/X11R7/include/freetype2 -I/usr/pkg/include -I/usr/X11R7/include -I/usr/include -I/usr/X11R7/include/freetype2 -I/usr/X11R7/include -I/tmp/pkgbuild/sysutils/xosview2/work.vax/xosview2-2.3.3 -I/tmp/pkgbuild/sysutils/xosview2/work.vax/xosview2-2.3.3/cmeter -I/tmp/pkgbuild/sysutils/xosview2/work.vax/xosview2-2.3.3/bsd -DHAVE_CONFIG_H -c pnetmeter.cc -o pnetmeter.o
distcc[5328] ERROR: nonblocking connect to 10.0.20.124:3632 failed: Connection refused
distcc[5328] Warning: failed to distribute pnetmeter.cc to 10.0.20.124:3632, running locally instead
c++ -O2 -D_FORTIFY_SOURCE=2 -I/usr/pkg/include -I/usr/X11R7/include -I/usr/include -I/usr/X11R7/include/freetype2 -I/usr/pkg/include -I/usr/X11R7/include -I/usr/include -I/usr/X11R7/include/freetype2 -I/usr/X11R7/include -I/tmp/pkgbuild/sysutils/xosview2/work.vax/xosview2-2.3.3 -I/tmp/pkgbuild/sysutils/xosview2/work.vax/xosview2-2.3.3/cmeter -I/tmp/pkgbuild/sysutils/xosview2/work.vax/xosview2-2.3.3/bsd -DHAVE_CONFIG_H -c cpagemeter.cc -o cpagemeter.o
distcc[1942] ERROR: nonblocking connect to 10.0.20.124:3632 failed: Connection refused
distcc[1942] Warning: failed to distribute cpagemeter.cc to 10.0.20.124:3632, running locally instead
c++ -O2 -D_FORTIFY_SOURCE=2 -I/usr/pkg/include -I/usr/X11R7/include -I/usr/include -I/usr/X11R7/include/freetype2 -I/usr/pkg/include -I/usr/X11R7/include -I/usr/include -I/usr/X11R7/include/freetype2 -I/usr/X11R7/include -I/tmp/pkgbuild/sysutils/xosview2/work.vax/xosview2-2.3.3 -I/tmp/pkgbuild/sysutils/xosview2/work.vax/xosview2-2.3.3/cmeter -I/tmp/pkgbuild/sysutils/xosview2/work.vax/xosview2-2.3.3/bsd -DHAVE_CONFIG_H -c ppagemeter.cc -o ppagemeter.o
distcc[25928] ERROR: nonblocking connect to 10.0.20.124:3632 failed: Connection refused
distcc[25928] Warning: failed to distribute ppagemeter.cc to 10.0.20.124:3632, running locally instead
c++ -O2 -D_FORTIFY_SOURCE=2 -I/usr/pkg/include -I/usr/X11R7/include -I/usr/include -I/usr/X11R7/include/freetype2 -I/usr/pkg/include -I/usr/X11R7/include -I/usr/include -I/usr/X11R7/include/freetype2 -I/usr/X11R7/include -I/tmp/pkgbuild/sysutils/xosview2/work.vax/xosview2-2.3.3 -I/tmp/pkgbuild/sysutils/xosview2/work.vax/xosview2-2.3.3/cmeter -I/tmp/pkgbuild/sysutils/xosview2/work.vax/xosview2-2.3.3/bsd -DHAVE_CONFIG_H -c ctzonemeter.cc -o ctzonemeter.o
distcc[24513] ERROR: nonblocking connect to 10.0.20.124:3632 failed: Connection refused
distcc[24513] Warning: failed to distribute ctzonemeter.cc to 10.0.20.124:3632, running locally instead
c++ -O2 -D_FORTIFY_SOURCE=2 -I/usr/pkg/include -I/usr/X11R7/include -I/usr/include -I/usr/X11R7/include/freetype2 -I/usr/pkg/include -I/usr/X11R7/include -I/usr/include -I/usr/X11R7/include/freetype2 -I/usr/X11R7/include -I/tmp/pkgbuild/sysutils/xosview2/work.vax/xosview2-2.3.3 -I/tmp/pkgbuild/sysutils/xosview2/work.vax/xosview2-2.3.3/cmeter -I/tmp/pkgbuild/sysutils/xosview2/work.vax/xosview2-2.3.3/bsd -DHAVE_CONFIG_H -c cdiskmeter.cc -o cdiskmeter.o
distcc[494] ERROR: nonblocking connect to 10.0.20.124:3632 failed: Connection refused
distcc[494] Warning: failed to distribute cdiskmeter.cc to 10.0.20.124:3632, running locally instead
c++ -O2 -D_FORTIFY_SOURCE=2 -I/usr/pkg/include -I/usr/X11R7/include -I/usr/include -I/usr/X11R7/include/freetype2 -I/usr/pkg/include -I/usr/X11R7/include -I/usr/include -I/usr/X11R7/include/freetype2 -I/usr/X11R7/include -I/tmp/pkgbuild/sysutils/xosview2/work.vax/xosview2-2.3.3 -I/tmp/pkgbuild/sysutils/xosview2/work.vax/xosview2-2.3.3/cmeter -I/tmp/pkgbuild/sysutils/xosview2/work.vax/xosview2-2.3.3/bsd -DHAVE_CONFIG_H -c pdiskmeter.cc -o pdiskmeter.o
distcc[22875] ERROR: nonblocking connect to 10.0.20.124:3632 failed: Connection refused
distcc[22875] Warning: failed to distribute pdiskmeter.cc to 10.0.20.124:3632, running locally instead
c++ -O2 -D_FORTIFY_SOURCE=2 -I/usr/pkg/include -I/usr/X11R7/include -I/usr/include -I/usr/X11R7/include/freetype2 -I/usr/pkg/include -I/usr/X11R7/include -I/usr/include -I/usr/X11R7/include/freetype2 -I/usr/X11R7/include -I/tmp/pkgbuild/sysutils/xosview2/work.vax/xosview2-2.3.3 -I/tmp/pkgbuild/sysutils/xosview2/work.vax/xosview2-2.3.3/cmeter -I/tmp/pkgbuild/sysutils/xosview2/work.vax/xosview2-2.3.3/bsd -DHAVE_CONFIG_H -c cintmeter.cc -o cintmeter.o
distcc[8790] ERROR: nonblocking connect to 10.0.20.124:3632 failed: Connection refused
distcc[8790] Warning: failed to distribute cintmeter.cc to 10.0.20.124:3632, running locally instead
c++ -O2 -D_FORTIFY_SOURCE=2 -I/usr/pkg/include -I/usr/X11R7/include -I/usr/include -I/usr/X11R7/include/freetype2 -I/usr/pkg/include -I/usr/X11R7/include -I/usr/include -I/usr/X11R7/include/freetype2 -I/usr/X11R7/include -I/tmp/pkgbuild/sysutils/xosview2/work.vax/xosview2-2.3.3 -I/tmp/pkgbuild/sysutils/xosview2/work.vax/xosview2-2.3.3/cmeter -I/tmp/pkgbuild/sysutils/xosview2/work.vax/xosview2-2.3.3/bsd -DHAVE_CONFIG_H -c cmetermaker.cc -o cmetermaker.o
distcc[12242] ERROR: nonblocking connect to 10.0.20.124:3632 failed: Connection refused
distcc[12242] Warning: failed to distribute cmetermaker.cc to 10.0.20.124:3632, running locally instead
ar cvrs libcmeter.a meter.o fieldmeter.o fieldmeterdecay.o fieldmetergraph.o bitmeter.o bitfieldmeter.o sensorfieldmeter.o cswapmeter.o pswapmeter.o cloadmeter.o ploadmeter.o pmemmeter.o cintratemeter.o pintratemeter.o cfsmeter.o cnetmeter.o pnetmeter.o cpagemeter.o ppagemeter.o ctzonemeter.o cdiskmeter.o pdiskmeter.o cintmeter.o cmetermaker.o
a - meter.o
a - fieldmeter.o
a - fieldmeterdecay.o
a - fieldmetergraph.o
a - bitmeter.o
a - bitfieldmeter.o
a - sensorfieldmeter.o
a - cswapmeter.o
a - pswapmeter.o
a - cloadmeter.o
a - ploadmeter.o
a - pmemmeter.o
a - cintratemeter.o
a - pintratemeter.o
a - cfsmeter.o
a - cnetmeter.o
a - pnetmeter.o
a - cpagemeter.o
a - ppagemeter.o
a - ctzonemeter.o
a - cdiskmeter.o
a - pdiskmeter.o
a - cintmeter.o
a - cmetermaker.o
cd /tmp/pkgbuild/sysutils/xosview2/work.vax/xosview2-2.3.3/bsd && /usr/bin/make
c++ -O2 -D_FORTIFY_SOURCE=2 -I/usr/pkg/include -I/usr/X11R7/include -I/usr/include -I/usr/X11R7/include/freetype2 -I/usr/pkg/include -I/usr/X11R7/include -I/usr/include -I/usr/X11R7/include/freetype2 -I/usr/X11R7/include -I/tmp/pkgbuild/sysutils/xosview2/work.vax/xosview2-2.3.3 -I/tmp/pkgbuild/sysutils/xosview2/work.vax/xosview2-2.3.3/cmeter -I/tmp/pkgbuild/sysutils/xosview2/work.vax/xosview2-2.3.3/bsd -DHAVE_CONFIG_H -c btrymeter.cc -o btrymeter.o
distcc[1607] ERROR: nonblocking connect to 10.0.20.124:3632 failed: Connection refused
distcc[1607] Warning: failed to distribute btrymeter.cc to 10.0.20.124:3632, running locally instead
c++ -O2 -D_FORTIFY_SOURCE=2 -I/usr/pkg/include -I/usr/X11R7/include -I/usr/include -I/usr/X11R7/include/freetype2 -I/usr/pkg/include -I/usr/X11R7/include -I/usr/include -I/usr/X11R7/include/freetype2 -I/usr/X11R7/include -I/tmp/pkgbuild/sysutils/xosview2/work.vax/xosview2-2.3.3 -I/tmp/pkgbuild/sysutils/xosview2/work.vax/xosview2-2.3.3/cmeter -I/tmp/pkgbuild/sysutils/xosview2/work.vax/xosview2-2.3.3/bsd -DHAVE_CONFIG_H -c cpumeter.cc -o cpumeter.o
distcc[9433] ERROR: nonblocking connect to 10.0.20.124:3632 failed: Connection refused
distcc[9433] Warning: failed to distribute cpumeter.cc to 10.0.20.124:3632, running locally instead
c++ -O2 -D_FORTIFY_SOURCE=2 -I/usr/pkg/include -I/usr/X11R7/include -I/usr/include -I/usr/X11R7/include/freetype2 -I/usr/pkg/include -I/usr/X11R7/include -I/usr/include -I/usr/X11R7/include/freetype2 -I/usr/X11R7/include -I/tmp/pkgbuild/sysutils/xosview2/work.vax/xosview2-2.3.3 -I/tmp/pkgbuild/sysutils/xosview2/work.vax/xosview2-2.3.3/cmeter -I/tmp/pkgbuild/sysutils/xosview2/work.vax/xosview2-2.3.3/bsd -DHAVE_CONFIG_H -c diskmeter.cc -o diskmeter.o
distcc[25377] ERROR: nonblocking connect to 10.0.20.124:3632 failed: Connection refused
distcc[25377] Warning: failed to distribute diskmeter.cc to 10.0.20.124:3632, running locally instead
c++ -O2 -D_FORTIFY_SOURCE=2 -I/usr/pkg/include -I/usr/X11R7/include -I/usr/include -I/usr/X11R7/include/freetype2 -I/usr/pkg/include -I/usr/X11R7/include -I/usr/include -I/usr/X11R7/include/freetype2 -I/usr/X11R7/include -I/tmp/pkgbuild/sysutils/xosview2/work.vax/xosview2-2.3.3 -I/tmp/pkgbuild/sysutils/xosview2/work.vax/xosview2-2.3.3/cmeter -I/tmp/pkgbuild/sysutils/xosview2/work.vax/xosview2-2.3.3/bsd -DHAVE_CONFIG_H -c intmeter.cc -o intmeter.o
distcc[3671] ERROR: nonblocking connect to 10.0.20.124:3632 failed: Connection refused
distcc[3671] Warning: failed to distribute intmeter.cc to 10.0.20.124:3632, running locally instead
c++ -O2 -D_FORTIFY_SOURCE=2 -I/usr/pkg/include -I/usr/X11R7/include -I/usr/include -I/usr/X11R7/include/freetype2 -I/usr/pkg/include -I/usr/X11R7/include -I/usr/include -I/usr/X11R7/include/freetype2 -I/usr/X11R7/include -I/tmp/pkgbuild/sysutils/xosview2/work.vax/xosview2-2.3.3 -I/tmp/pkgbuild/sysutils/xosview2/work.vax/xosview2-2.3.3/cmeter -I/tmp/pkgbuild/sysutils/xosview2/work.vax/xosview2-2.3.3/bsd -DHAVE_CONFIG_H -c intratemeter.cc -o intratemeter.o
distcc[14513] ERROR: nonblocking connect to 10.0.20.124:3632 failed: Connection refused
distcc[14513] Warning: failed to distribute intratemeter.cc to 10.0.20.124:3632, running locally instead
c++ -O2 -D_FORTIFY_SOURCE=2 -I/usr/pkg/include -I/usr/X11R7/include -I/usr/include -I/usr/X11R7/include/freetype2 -I/usr/pkg/include -I/usr/X11R7/include -I/usr/include -I/usr/X11R7/include/freetype2 -I/usr/X11R7/include -I/tmp/pkgbuild/sysutils/xosview2/work.vax/xosview2-2.3.3 -I/tmp/pkgbuild/sysutils/xosview2/work.vax/xosview2-2.3.3/cmeter -I/tmp/pkgbuild/sysutils/xosview2/work.vax/xosview2-2.3.3/bsd -DHAVE_CONFIG_H -c intrstats.cc -o intrstats.o
distcc[13122] ERROR: nonblocking connect to 10.0.20.124:3632 failed: Connection refused
distcc[13122] Warning: failed to distribute intrstats.cc to 10.0.20.124:3632, running locally instead
c++ -O2 -D_FORTIFY_SOURCE=2 -I/usr/pkg/include -I/usr/X11R7/include -I/usr/include -I/usr/X11R7/include/freetype2 -I/usr/pkg/include -I/usr/X11R7/include -I/usr/include -I/usr/X11R7/include/freetype2 -I/usr/X11R7/include -I/tmp/pkgbuild/sysutils/xosview2/work.vax/xosview2-2.3.3 -I/tmp/pkgbuild/sysutils/xosview2/work.vax/xosview2-2.3.3/cmeter -I/tmp/pkgbuild/sysutils/xosview2/work.vax/xosview2-2.3.3/bsd -DHAVE_CONFIG_H -c kernel.cc -o kernel.o
distcc[8895] ERROR: nonblocking connect to 10.0.20.124:3632 failed: Connection refused
distcc[8895] Warning: failed to distribute kernel.cc to 10.0.20.124:3632, running locally instead
c++ -O2 -D_FORTIFY_SOURCE=2 -I/usr/pkg/include -I/usr/X11R7/include -I/usr/include -I/usr/X11R7/include/freetype2 -I/usr/pkg/include -I/usr/X11R7/include -I/usr/include -I/usr/X11R7/include/freetype2 -I/usr/X11R7/include -I/tmp/pkgbuild/sysutils/xosview2/work.vax/xosview2-2.3.3 -I/tmp/pkgbuild/sysutils/xosview2/work.vax/xosview2-2.3.3/cmeter -I/tmp/pkgbuild/sysutils/xosview2/work.vax/xosview2-2.3.3/bsd -DHAVE_CONFIG_H -c loadmeter.cc -o loadmeter.o
distcc[7236] ERROR: nonblocking connect to 10.0.20.124:3632 failed: Connection refused
distcc[7236] Warning: failed to distribute loadmeter.cc to 10.0.20.124:3632, running locally instead
c++ -O2 -D_FORTIFY_SOURCE=2 -I/usr/pkg/include -I/usr/X11R7/include -I/usr/include -I/usr/X11R7/include/freetype2 -I/usr/pkg/include -I/usr/X11R7/include -I/usr/include -I/usr/X11R7/include/freetype2 -I/usr/X11R7/include -I/tmp/pkgbuild/sysutils/xosview2/work.vax/xosview2-2.3.3 -I/tmp/pkgbuild/sysutils/xosview2/work.vax/xosview2-2.3.3/cmeter -I/tmp/pkgbuild/sysutils/xosview2/work.vax/xosview2-2.3.3/bsd -DHAVE_CONFIG_H -c memmeter.cc -o memmeter.o
distcc[3548] ERROR: nonblocking connect to 10.0.20.124:3632 failed: Connection refused
distcc[3548] Warning: failed to distribute memmeter.cc to 10.0.20.124:3632, running locally instead
c++ -O2 -D_FORTIFY_SOURCE=2 -I/usr/pkg/include -I/usr/X11R7/include -I/usr/include -I/usr/X11R7/include/freetype2 -I/usr/pkg/include -I/usr/X11R7/include -I/usr/include -I/usr/X11R7/include/freetype2 -I/usr/X11R7/include -I/tmp/pkgbuild/sysutils/xosview2/work.vax/xosview2-2.3.3 -I/tmp/pkgbuild/sysutils/xosview2/work.vax/xosview2-2.3.3/cmeter -I/tmp/pkgbuild/sysutils/xosview2/work.vax/xosview2-2.3.3/bsd -DHAVE_CONFIG_H -c netmeter.cc -o netmeter.o
distcc[22911] ERROR: nonblocking connect to 10.0.20.124:3632 failed: Connection refused
distcc[22911] Warning: failed to distribute netmeter.cc to 10.0.20.124:3632, running locally instead
c++ -O2 -D_FORTIFY_SOURCE=2 -I/usr/pkg/include -I/usr/X11R7/include -I/usr/include -I/usr/X11R7/include/freetype2 -I/usr/pkg/include -I/usr/X11R7/include -I/usr/include -I/usr/X11R7/include/freetype2 -I/usr/X11R7/include -I/tmp/pkgbuild/sysutils/xosview2/work.vax/xosview2-2.3.3 -I/tmp/pkgbuild/sysutils/xosview2/work.vax/xosview2-2.3.3/cmeter -I/tmp/pkgbuild/sysutils/xosview2/work.vax/xosview2-2.3.3/bsd -DHAVE_CONFIG_H -c pagemeter.cc -o pagemeter.o
distcc[12370] ERROR: nonblocking connect to 10.0.20.124:3632 failed: Connection refused
distcc[12370] Warning: failed to distribute pagemeter.cc to 10.0.20.124:3632, running locally instead
c++ -O2 -D_FORTIFY_SOURCE=2 -I/usr/pkg/include -I/usr/X11R7/include -I/usr/include -I/usr/X11R7/include/freetype2 -I/usr/pkg/include -I/usr/X11R7/include -I/usr/include -I/usr/X11R7/include/freetype2 -I/usr/X11R7/include -I/tmp/pkgbuild/sysutils/xosview2/work.vax/xosview2-2.3.3 -I/tmp/pkgbuild/sysutils/xosview2/work.vax/xosview2-2.3.3/cmeter -I/tmp/pkgbuild/sysutils/xosview2/work.vax/xosview2-2.3.3/bsd -DHAVE_CONFIG_H -c swapmeter.cc -o swapmeter.o
distcc[3774] ERROR: nonblocking connect to 10.0.20.124:3632 failed: Connection refused
distcc[3774] Warning: failed to distribute swapmeter.cc to 10.0.20.124:3632, running locally instead
c++ -O2 -D_FORTIFY_SOURCE=2 -I/usr/pkg/include -I/usr/X11R7/include -I/usr/include -I/usr/X11R7/include/freetype2 -I/usr/pkg/include -I/usr/X11R7/include -I/usr/include -I/usr/X11R7/include/freetype2 -I/usr/X11R7/include -I/tmp/pkgbuild/sysutils/xosview2/work.vax/xosview2-2.3.3 -I/tmp/pkgbuild/sysutils/xosview2/work.vax/xosview2-2.3.3/cmeter -I/tmp/pkgbuild/sysutils/xosview2/work.vax/xosview2-2.3.3/bsd -DHAVE_CONFIG_H -c fsmeter.cc -o fsmeter.o
distcc[12499] ERROR: nonblocking connect to 10.0.20.124:3632 failed: Connection refused
distcc[12499] Warning: failed to distribute fsmeter.cc to 10.0.20.124:3632, running locally instead
c++ -O2 -D_FORTIFY_SOURCE=2 -I/usr/pkg/include -I/usr/X11R7/include -I/usr/include -I/usr/X11R7/include/freetype2 -I/usr/pkg/include -I/usr/X11R7/include -I/usr/include -I/usr/X11R7/include/freetype2 -I/usr/X11R7/include -I/tmp/pkgbuild/sysutils/xosview2/work.vax/xosview2-2.3.3 -I/tmp/pkgbuild/sysutils/xosview2/work.vax/xosview2-2.3.3/cmeter -I/tmp/pkgbuild/sysutils/xosview2/work.vax/xosview2-2.3.3/bsd -DHAVE_CONFIG_H -c sensor.cc -o sensor.o
distcc[27693] ERROR: nonblocking connect to 10.0.20.124:3632 failed: Connection refused
distcc[27693] Warning: failed to distribute sensor.cc to 10.0.20.124:3632, running locally instead
c++ -O2 -D_FORTIFY_SOURCE=2 -I/usr/pkg/include -I/usr/X11R7/include -I/usr/include -I/usr/X11R7/include/freetype2 -I/usr/pkg/include -I/usr/X11R7/include -I/usr/include -I/usr/X11R7/include/freetype2 -I/usr/X11R7/include -I/tmp/pkgbuild/sysutils/xosview2/work.vax/xosview2-2.3.3 -I/tmp/pkgbuild/sysutils/xosview2/work.vax/xosview2-2.3.3/cmeter -I/tmp/pkgbuild/sysutils/xosview2/work.vax/xosview2-2.3.3/bsd -DHAVE_CONFIG_H -c coretemp.cc -o coretemp.o
distcc[3799] ERROR: nonblocking connect to 10.0.20.124:3632 failed: Connection refused
distcc[3799] Warning: failed to distribute coretemp.cc to 10.0.20.124:3632, running locally instead
coretemp.cc: In member function 'virtual void CoreTemp::checkResources(const ResDB&)':
coretemp.cc:50:5: error: 'BSDGetCPUTemperature' was not declared in this scope
   50 |     BSDGetCPUTemperature(_temps, tjmax);
      |     ^~~~~~~~~~~~~~~~~~~~
coretemp.cc: In static member function 'static unsigned int CoreTemp::countCpus()':
coretemp.cc:75:12: error: 'BSDGetCPUTemperature' was not declared in this scope
   75 |     return BSDGetCPUTemperature();
      |            ^~~~~~~~~~~~~~~~~~~~
coretemp.cc: In member function 'void CoreTemp::getcoretemp()':
coretemp.cc:107:5: error: 'BSDGetCPUTemperature' was not declared in this scope
  107 |     BSDGetCPUTemperature(_temps);
      |     ^~~~~~~~~~~~~~~~~~~~
distcc[3799] ERROR: compile coretemp.cc on localhost failed
*** Error code 1

Stop.
make[1]: stopped in /tmp/pkgbuild/sysutils/xosview2/work.vax/xosview2-2.3.3/bsd
*** Error code 1

Stop.
make: stopped in /tmp/pkgbuild/sysutils/xosview2/work.vax/xosview2-2.3.3
*** Error code 1

Stop.
make[1]: stopped in /usr/pkgsrc/sysutils/xosview2
*** Error code 1

Stop.
make: stopped in /usr/pkgsrc/sysutils/xosview2