=> Bootstrap dependency digest>=20211023: found digest-20220214
===> Skipping vulnerability checks.
WARNING: No /usr/pkg/pkgdb/pkg-vulnerabilities file found.
WARNING: To fix run: `/usr/sbin/pkg_admin -K /usr/pkg/pkgdb fetch-pkg-vulnerabilities'.
===> Building for syncterm-1.1nb5
/usr/pkg/bin/gmake -C /tmp/pkgbuild/comms/syncterm/work.aarch64eb/syncterm-1.1/src/xpdev mtlib
/usr/pkg/bin/gmake -C /tmp/pkgbuild/comms/syncterm/work.aarch64eb/syncterm-1.1/src/conio mtlib
/usr/pkg/bin/gmake -C /tmp/pkgbuild/comms/syncterm/work.aarch64eb/syncterm-1.1/src/uifc mtlib
gmake[1]: Entering directory '/tmp/pkgbuild/comms/syncterm/work.aarch64eb/syncterm-1.1/src/xpdev'
gmake[1]: Entering directory '/tmp/pkgbuild/comms/syncterm/work.aarch64eb/syncterm-1.1/src/uifc'
gmake[1]: Entering directory '/tmp/pkgbuild/comms/syncterm/work.aarch64eb/syncterm-1.1/src/conio'
Compiling uifc32.c
Compiling conwrap.c
Compiling ansi_cio.c
In file included from uifc32.c:49:
/tmp/pkgbuild/comms/syncterm/work.aarch64eb/syncterm-1.1/src/xpdev/genwrap.h:211:3: error: #error "Need to describe target architecture"
  211 |  #error "Need to describe target architecture"
      |   ^~~~~
/tmp/pkgbuild/comms/syncterm/work.aarch64eb/syncterm-1.1/src/xpdev/genwrap.h:219: warning: "snprintf" redefined
  219 |  #define snprintf  safe_snprintf
      | 
In file included from /usr/include/stdio.h:595,
                 from uifc32.c:38:
/usr/include/ssp/stdio.h:61: note: this is the location of the previous definition
   61 | #define snprintf(str, len, ...) \
      | 
In file included from ansi_cio.c:38:
/tmp/pkgbuild/comms/syncterm/work.aarch64eb/syncterm-1.1/src/xpdev/genwrap.h:211:3: error: #error "Need to describe target architecture"
  211 |  #error "Need to describe target architecture"
      |   ^~~~~
/tmp/pkgbuild/comms/syncterm/work.aarch64eb/syncterm-1.1/src/xpdev/genwrap.h:219: warning: "snprintf" redefined
  219 |  #define snprintf  safe_snprintf
      | 
In file included from /usr/include/stdio.h:595,
                 from /tmp/pkgbuild/comms/syncterm/work.aarch64eb/syncterm-1.1/src/xpdev/genwrap.h:40,
                 from ansi_cio.c:38:
/usr/include/ssp/stdio.h:61: note: this is the location of the previous definition
   61 | #define snprintf(str, len, ...) \
      | 
distcc[29046] ERROR: compile uifc32.c on 10.0.20.122:3660 failed
distcc[29046] (dcc_build_somewhere) Warning: remote compilation of 'uifc32.c' failed, retrying locally
distcc[29046] Warning: failed to distribute uifc32.c to 10.0.20.122:3660, running locally instead
In file included from uifc32.c:49:
/tmp/pkgbuild/comms/syncterm/work.aarch64eb/syncterm-1.1/src/xpdev/genwrap.h:211:3: error: #error "Need to describe target architecture"
  211 |  #error "Need to describe target architecture"
      |   ^~~~~
/tmp/pkgbuild/comms/syncterm/work.aarch64eb/syncterm-1.1/src/xpdev/genwrap.h:219: warning: "snprintf" redefined
  219 |  #define snprintf  safe_snprintf
      | 
In file included from /usr/include/stdio.h:595,
                 from uifc32.c:38:
/usr/include/ssp/stdio.h:61: note: this is the location of the previous definition
   61 | #define snprintf(str, len, ...) \
      | 
Compiling dat_file.c
distcc[10973] ERROR: compile ansi_cio.c on 10.0.20.122:3660 failed
distcc[10973] (dcc_build_somewhere) Warning: remote compilation of 'ansi_cio.c' failed, retrying locally
distcc[10973] Warning: failed to distribute ansi_cio.c to 10.0.20.122:3660, running locally instead
In file included from dat_file.c:39:
genwrap.h:211:3: error: #error "Need to describe target architecture"
  211 |  #error "Need to describe target architecture"
      |   ^~~~~
genwrap.h:219: warning: "snprintf" redefined
  219 |  #define snprintf  safe_snprintf
      | 
In file included from /usr/include/stdio.h:595,
                 from str_list.h:41,
                 from dat_file.h:41,
                 from dat_file.c:38:
/usr/include/ssp/stdio.h:61: note: this is the location of the previous definition
   61 | #define snprintf(str, len, ...) \
      | 
distcc[3156] ERROR: compile dat_file.c on 10.0.20.122:3660 failed
distcc[3156] (dcc_build_somewhere) Warning: remote compilation of 'dat_file.c' failed, retrying locally
distcc[3156] Warning: failed to distribute dat_file.c to 10.0.20.122:3660, running locally instead
In file included from ansi_cio.c:38:
/tmp/pkgbuild/comms/syncterm/work.aarch64eb/syncterm-1.1/src/xpdev/genwrap.h:211:3: error: #error "Need to describe target architecture"
  211 |  #error "Need to describe target architecture"
      |   ^~~~~
/tmp/pkgbuild/comms/syncterm/work.aarch64eb/syncterm-1.1/src/xpdev/genwrap.h:219: warning: "snprintf" redefined
  219 |  #define snprintf  safe_snprintf
      | 
In file included from /usr/include/stdio.h:595,
                 from /tmp/pkgbuild/comms/syncterm/work.aarch64eb/syncterm-1.1/src/xpdev/genwrap.h:40,
                 from ansi_cio.c:38:
/usr/include/ssp/stdio.h:61: note: this is the location of the previous definition
   61 | #define snprintf(str, len, ...) \
      | 
In file included from dat_file.c:39:
genwrap.h:211:3: error: #error "Need to describe target architecture"
  211 |  #error "Need to describe target architecture"
      |   ^~~~~
genwrap.h:219: warning: "snprintf" redefined
  219 |  #define snprintf  safe_snprintf
      | 
In file included from /usr/include/stdio.h:595,
                 from str_list.h:41,
                 from dat_file.h:41,
                 from dat_file.c:38:
/usr/include/ssp/stdio.h:61: note: this is the location of the previous definition
   61 | #define snprintf(str, len, ...) \
      | 
distcc[3156] ERROR: compile dat_file.c on localhost failed
gmake[1]: *** [/tmp/pkgbuild/comms/syncterm/work.aarch64eb/syncterm-1.1/src/build/Common.gmake:455: gcc.netbsd.evbarm.obj.release-mt/dat_file.o] Error 1
gmake[1]: Leaving directory '/tmp/pkgbuild/comms/syncterm/work.aarch64eb/syncterm-1.1/src/xpdev'
gmake: *** [/tmp/pkgbuild/comms/syncterm/work.aarch64eb/syncterm-1.1/src/build/Common.gmake:487: xpdev-mt] Error 2
gmake: *** Waiting for unfinished jobs....
Compiling uifcx.c
In file included from uifcx.c:36:
/tmp/pkgbuild/comms/syncterm/work.aarch64eb/syncterm-1.1/src/xpdev/genwrap.h:211:3: error: #error "Need to describe target architecture"
  211 |  #error "Need to describe target architecture"
      |   ^~~~~
/tmp/pkgbuild/comms/syncterm/work.aarch64eb/syncterm-1.1/src/xpdev/genwrap.h:219: warning: "snprintf" redefined
  219 |  #define snprintf  safe_snprintf
      | 
In file included from /usr/include/stdio.h:595,
                 from /tmp/pkgbuild/comms/syncterm/work.aarch64eb/syncterm-1.1/src/xpdev/genwrap.h:40,
                 from uifcx.c:36:
/usr/include/ssp/stdio.h:61: note: this is the location of the previous definition
   61 | #define snprintf(str, len, ...) \
      | 
distcc[15834] ERROR: compile uifcx.c on 10.0.20.122:3660 failed
distcc[15834] (dcc_build_somewhere) Warning: remote compilation of 'uifcx.c' failed, retrying locally
distcc[15834] Warning: failed to distribute uifcx.c to 10.0.20.122:3660, running locally instead
In file included from uifcx.c:36:
/tmp/pkgbuild/comms/syncterm/work.aarch64eb/syncterm-1.1/src/xpdev/genwrap.h:211:3: error: #error "Need to describe target architecture"
  211 |  #error "Need to describe target architecture"
      |   ^~~~~
/tmp/pkgbuild/comms/syncterm/work.aarch64eb/syncterm-1.1/src/xpdev/genwrap.h:219: warning: "snprintf" redefined
  219 |  #define snprintf  safe_snprintf
      | 
In file included from /usr/include/stdio.h:595,
                 from /tmp/pkgbuild/comms/syncterm/work.aarch64eb/syncterm-1.1/src/xpdev/genwrap.h:40,
                 from uifcx.c:36:
/usr/include/ssp/stdio.h:61: note: this is the location of the previous definition
   61 | #define snprintf(str, len, ...) \
      | 
distcc[15834] ERROR: compile uifcx.c on localhost failed
gmake[1]: *** [/tmp/pkgbuild/comms/syncterm/work.aarch64eb/syncterm-1.1/src/build/Common.gmake:456: gcc.netbsd.evbarm.obj.release-mt/uifcx.o] Error 1
gmake[1]: *** Waiting for unfinished jobs....
Compiling ciolib.c
In file included from ciolib.c:48:
/tmp/pkgbuild/comms/syncterm/work.aarch64eb/syncterm-1.1/src/xpdev/genwrap.h:211:3: error: #error "Need to describe target architecture"
  211 |  #error "Need to describe target architecture"
      |   ^~~~~
/tmp/pkgbuild/comms/syncterm/work.aarch64eb/syncterm-1.1/src/xpdev/genwrap.h:219: warning: "snprintf" redefined
  219 |  #define snprintf  safe_snprintf
      | 
In file included from /usr/include/stdio.h:595,
                 from ciolib.c:42:
/usr/include/ssp/stdio.h:61: note: this is the location of the previous definition
   61 | #define snprintf(str, len, ...) \
      | 
distcc[10973] ERROR: compile ansi_cio.c on localhost failed
gmake[1]: *** [/tmp/pkgbuild/comms/syncterm/work.aarch64eb/syncterm-1.1/src/build/Common.gmake:456: gcc.netbsd.evbarm.obj.release-mt/ansi_cio.o] Error 1
gmake[1]: *** Waiting for unfinished jobs....
distcc[11214] ERROR: compile ciolib.c on 10.0.20.122:3660 failed
distcc[11214] (dcc_build_somewhere) Warning: remote compilation of 'ciolib.c' failed, retrying locally
distcc[11214] Warning: failed to distribute ciolib.c to 10.0.20.122:3660, running locally instead
In file included from ciolib.c:48:
/tmp/pkgbuild/comms/syncterm/work.aarch64eb/syncterm-1.1/src/xpdev/genwrap.h:211:3: error: #error "Need to describe target architecture"
  211 |  #error "Need to describe target architecture"
      |   ^~~~~
/tmp/pkgbuild/comms/syncterm/work.aarch64eb/syncterm-1.1/src/xpdev/genwrap.h:219: warning: "snprintf" redefined
  219 |  #define snprintf  safe_snprintf
      | 
In file included from /usr/include/stdio.h:595,
                 from ciolib.c:42:
/usr/include/ssp/stdio.h:61: note: this is the location of the previous definition
   61 | #define snprintf(str, len, ...) \
      | 
distcc[29046] ERROR: compile uifc32.c on localhost failed
gmake[1]: *** [/tmp/pkgbuild/comms/syncterm/work.aarch64eb/syncterm-1.1/src/build/Common.gmake:456: gcc.netbsd.evbarm.obj.release-mt/uifc32.o] Error 1
gmake[1]: Leaving directory '/tmp/pkgbuild/comms/syncterm/work.aarch64eb/syncterm-1.1/src/uifc'
gmake: *** [/tmp/pkgbuild/comms/syncterm/work.aarch64eb/syncterm-1.1/src/build/Common.gmake:511: uifc-mt] Error 2
distcc[11214] ERROR: compile ciolib.c on localhost failed
gmake[1]: *** [/tmp/pkgbuild/comms/syncterm/work.aarch64eb/syncterm-1.1/src/build/Common.gmake:456: gcc.netbsd.evbarm.obj.release-mt/ciolib.o] Error 1
gmake[1]: Leaving directory '/tmp/pkgbuild/comms/syncterm/work.aarch64eb/syncterm-1.1/src/conio'
gmake: *** [/tmp/pkgbuild/comms/syncterm/work.aarch64eb/syncterm-1.1/src/build/Common.gmake:503: ciolib-mt] Error 2
*** Error code 2

Stop.
make[1]: stopped in /usr/pkgsrc/comms/syncterm
*** Error code 1

Stop.
make: stopped in /usr/pkgsrc/comms/syncterm