=> Bootstrap dependency digest>=20211023: found digest-20220214
===> Skipping vulnerability checks.
WARNING: No /usr/pkg/pkgdb/pkg-vulnerabilities file found.
WARNING: To fix run: `/usr/sbin/pkg_admin -K /usr/pkg/pkgdb fetch-pkg-vulnerabilities'.
===> Building for 7-zip-23.01
mkdir -p _o
gcc      -O2 -c -O2  -I/usr/include  -DNDEBUG -D_REENTRANT -D_FILE_OFFSET_BITS=64 -D_LARGEFILE_SOURCE -fPIC   -o _o/7zBuf2.o ../../../../C/7zBuf2.c
gcc      -O2 -c -O2  -I/usr/include  -DNDEBUG -D_REENTRANT -D_FILE_OFFSET_BITS=64 -D_LARGEFILE_SOURCE -fPIC   -o _o/7zStream.o ../../../../C/7zStream.c
gcc      -O2 -c -O2  -I/usr/include  -DNDEBUG -D_REENTRANT -D_FILE_OFFSET_BITS=64 -D_LARGEFILE_SOURCE -fPIC   -o _o/Alloc.o ../../../../C/Alloc.c
gcc      -O2 -c -O2  -I/usr/include  -DNDEBUG -D_REENTRANT -D_FILE_OFFSET_BITS=64 -D_LARGEFILE_SOURCE -fPIC   -o _o/Bcj2.o ../../../../C/Bcj2.c
gcc      -O2 -c -O2  -I/usr/include  -DNDEBUG -D_REENTRANT -D_FILE_OFFSET_BITS=64 -D_LARGEFILE_SOURCE -fPIC   -o _o/Bcj2Enc.o ../../../../C/Bcj2Enc.c
gcc      -O2 -c -O2  -I/usr/include  -DNDEBUG -D_REENTRANT -D_FILE_OFFSET_BITS=64 -D_LARGEFILE_SOURCE -fPIC   -o _o/Blake2s.o ../../../../C/Blake2s.c
gcc      -O2 -c -O2  -I/usr/include  -DNDEBUG -D_REENTRANT -D_FILE_OFFSET_BITS=64 -D_LARGEFILE_SOURCE -fPIC   -o _o/Bra.o ../../../../C/Bra.c
gcc      -O2 -c -O2  -I/usr/include  -DNDEBUG -D_REENTRANT -D_FILE_OFFSET_BITS=64 -D_LARGEFILE_SOURCE -fPIC   -o _o/Bra86.o ../../../../C/Bra86.c
gcc      -O2 -c -O2  -I/usr/include  -DNDEBUG -D_REENTRANT -D_FILE_OFFSET_BITS=64 -D_LARGEFILE_SOURCE -fPIC   -o _o/BraIA64.o ../../../../C/BraIA64.c
gcc      -O2 -c -O2  -I/usr/include  -DNDEBUG -D_REENTRANT -D_FILE_OFFSET_BITS=64 -D_LARGEFILE_SOURCE -fPIC   -o _o/BwtSort.o ../../../../C/BwtSort.c
gcc      -O2 -c -O2  -I/usr/include  -DNDEBUG -D_REENTRANT -D_FILE_OFFSET_BITS=64 -D_LARGEFILE_SOURCE -fPIC   -o _o/CpuArch.o ../../../../C/CpuArch.c
../../../../C/CpuArch.c:763:10: fatal error: sys/auxv.h: No such file or directory
  763 | #include <sys/auxv.h>
      |          ^~~~~~~~~~~~
compilation terminated.
distcc[26281] ERROR: compile ../../../../C/CpuArch.c on 10.0.20.122:3760 failed
distcc[26281] (dcc_build_somewhere) Warning: remote compilation of '../../../../C/CpuArch.c' failed, retrying locally
distcc[26281] Warning: failed to distribute ../../../../C/CpuArch.c to 10.0.20.122:3760, running locally instead
gcc      -O2 -c -O2  -I/usr/include  -DNDEBUG -D_REENTRANT -D_FILE_OFFSET_BITS=64 -D_LARGEFILE_SOURCE -fPIC   -o _o/Delta.o ../../../../C/Delta.c
../../../../C/CpuArch.c:763:10: fatal error: sys/auxv.h: No such file or directory
  763 | #include <sys/auxv.h>
      |          ^~~~~~~~~~~~
compilation terminated.
distcc[26281] ERROR: compile ../../../../C/CpuArch.c on localhost failed
gmake: *** [../../7zip_gcc.mak:1124: _o/CpuArch.o] Error 1
gmake: *** Waiting for unfinished jobs....
*** Error code 2

Stop.
make[1]: stopped in /usr/pkgsrc/archivers/7-zip
*** Error code 1

Stop.
make: stopped in /usr/pkgsrc/archivers/7-zip