=> Bootstrap dependency digest>=20211023: found digest-20220214
===> Skipping vulnerability checks.
WARNING: No /usr/pkg/pkgdb/pkg-vulnerabilities file found.
WARNING: To fix run: `/usr/sbin/pkg_admin -K /usr/pkg/pkgdb fetch-pkg-vulnerabilities'.
===> Building for bcc-95.3.12nb3
--- all-ld ---
--- all-as ---
--- all-bcc-cc1 ---
--- all-ld ---
all ===> ld
--- all-as ---
all ===> as
--- all-bcc-cc1 ---
all ===> bcc-cc1
--- all-ld ---
--- .gdbinit ---
--- all-as ---
--- .gdbinit ---
--- all-ld ---
rm -f .gdbinit
--- all-as ---
rm -f .gdbinit
--- all-ld ---
touch .gdbinit
--- all-as ---
touch .gdbinit
--- all-ld ---
--- dumps.o ---
--- all-as ---
--- as.o ---
#   compile  as/as.o
gcc -O2 -m32   -fPIE    -std=gnu99          -c    as.c -o as.o
--- all-ld ---
#   compile  ld/dumps.o
gcc -O2 -m32   -fPIE    -std=gnu99         -DBSD_A_OUT -DSTANDARD_GNU_A_OUT  -c    dumps.c -o dumps.o
--- all-bcc-cc1 ---
--- .gdbinit ---
rm -f .gdbinit
--- all-as ---
gcc: error: unrecognized command-line option '-m32'
--- all-bcc-cc1 ---
touch .gdbinit
--- all-as ---
distcc[16827] ERROR: compile as.c on 10.0.20.122:3760 failed
distcc[16827] (dcc_build_somewhere) Warning: remote compilation of 'as.c' failed, retrying locally
distcc[16827] Warning: failed to distribute as.c to 10.0.20.122:3760, running locally instead
--- all-ld ---
gcc: error: unrecognized command-line option '-m32'
distcc[28637] ERROR: compile dumps.c on 10.0.20.122:3760 failed
distcc[28637] (dcc_build_somewhere) Warning: remote compilation of 'dumps.c' failed, retrying locally
distcc[28637] Warning: failed to distribute dumps.c to 10.0.20.122:3760, running locally instead
--- all-bcc-cc1 ---
--- assign.o ---
#   compile  bcc-cc1/assign.o
gcc -O2 -m32   -fPIE    -std=gnu99         -DNSIG=32 -DLOCALPREFIX=\"/usr/pkg\"  -c    ../bcc/assign.c -o assign.o
--- all-as ---
gcc: error: unrecognized command-line option '-m32'
distcc[16827] ERROR: compile as.c on localhost failed
*** [as.o] Error code 1

make[1]: stopped in /tmp/pkgbuild/devel/bcc/work.aarch64eb/bcc/as
1 error

make[1]: stopped in /tmp/pkgbuild/devel/bcc/work.aarch64eb/bcc/as

make: stopped in /tmp/pkgbuild/devel/bcc/work.aarch64eb/bcc
--- all-bcc-cc1 ---

make: stopped in /tmp/pkgbuild/devel/bcc/work.aarch64eb/bcc
--- all-ld ---

make: stopped in /tmp/pkgbuild/devel/bcc/work.aarch64eb/bcc
*** Error code 2

Stop.
make[1]: stopped in /usr/pkgsrc/devel/bcc
*** Error code 1

Stop.
make: stopped in /usr/pkgsrc/devel/bcc