=> Bootstrap dependency digest>=20211023: found digest-20220214
===> Skipping vulnerability checks.
WARNING: No /usr/pkg/pkgdb/pkg-vulnerabilities file found.
WARNING: To fix run: `/usr/sbin/pkg_admin -K /usr/pkg/pkgdb fetch-pkg-vulnerabilities'.
===> Building for compiler-rt-16.0.6
[  0%] Building CXX object lib/fuzzer/CMakeFiles/RTfuzzer_interceptors.aarch64.dir/FuzzerInterceptors.cpp.o
[  1%] Building CXX object lib/fuzzer/CMakeFiles/RTfuzzer.aarch64.dir/FuzzerCrossOver.cpp.o
[  1%] Building CXX object lib/orc/CMakeFiles/RTOrc.aarch64.dir/debug.cpp.o
[  1%] Built target RTfuzzer_interceptors.aarch64
[  1%] Building CXX object lib/orc/CMakeFiles/RTOrc.aarch64.dir/extensible_rtti.cpp.o
[  1%] Building CXX object lib/fuzzer/CMakeFiles/RTfuzzer_main.aarch64.dir/FuzzerMain.cpp.o
[  1%] Building CXX object lib/orc/CMakeFiles/RTOrc.aarch64.dir/log_error_to_stderr.cpp.o
[  1%] Building CXX object lib/orc/CMakeFiles/RTOrc.aarch64.dir/run_program_wrapper.cpp.o
[  1%] Built target RTfuzzer_main.aarch64
[  1%] Building CXX object lib/xray/CMakeFiles/RTXrayPROFILING.aarch64.dir/xray_profile_collector.cpp.o
[  1%] Building CXX object lib/fuzzer/CMakeFiles/RTfuzzer.aarch64.dir/FuzzerDataFlowTrace.cpp.o
[  1%] Building CXX object lib/orc/CMakeFiles/RTOrc.aarch64.dir/dlfcn_wrapper.cpp.o
In file included from /tmp/pkgbuild/lang/compiler-rt/work.aarch64eb/compiler-rt-16.0.6.src/lib/xray/xray_function_call_trie.h:20,
                 from /tmp/pkgbuild/lang/compiler-rt/work.aarch64eb/compiler-rt-16.0.6.src/lib/xray/xray_profile_collector.h:20,
                 from /tmp/pkgbuild/lang/compiler-rt/work.aarch64eb/compiler-rt-16.0.6.src/lib/xray/xray_profile_collector.cpp:14:
In member function 'T* __xray::Array<T>::Append(const T&) [with T = int]',
    inlined from 'void __xray::profileCollectorService::{anonymous}::populateRecords(__xray::profileCollectorService::{anonymous}::ProfileRecordArray&, __xray::profileCollectorService::ProfileRecord::PathAllocator&, const __xray::FunctionCallTrie&)' at /tmp/pkgbuild/lang/compiler-rt/work.aarch64eb/compiler-rt-16.0.6.src/lib/xray/xray_profile_collector.cpp:188:28,
    inlined from 'void __xray::profileCollectorService::serialize()' at /tmp/pkgbuild/lang/compiler-rt/work.aarch64eb/compiler-rt-16.0.6.src/lib/xray/xray_profile_collector.cpp:279:20:
/tmp/pkgbuild/lang/compiler-rt/work.aarch64eb/compiler-rt-16.0.6.src/lib/xray/xray_segmented_array.h:409:5: warning: writing 4 bytes into a region of size 1 [-Wstringop-overflow=]
In file included from /tmp/pkgbuild/lang/compiler-rt/work.aarch64eb/compiler-rt-16.0.6.src/lib/xray/xray_function_call_trie.h:20,
                 from /tmp/pkgbuild/lang/compiler-rt/work.aarch64eb/compiler-rt-16.0.6.src/lib/xray/xray_profile_collector.h:20,
                 from /tmp/pkgbuild/lang/compiler-rt/work.aarch64eb/compiler-rt-16.0.6.src/lib/xray/xray_profile_collector.cpp:14:
/tmp/pkgbuild/lang/compiler-rt/work.aarch64eb/compiler-rt-16.0.6.src/lib/xray/xray_segmented_array.h: In function 'void __xray::profileCollectorService::serialize()':
/tmp/pkgbuild/lang/compiler-rt/work.aarch64eb/compiler-rt-16.0.6.src/lib/xray/xray_segmented_array.h:37:10: note: at offset 0 to object '__xray::Array<int>::Segment::Data' with size 1 declared here
In file included from /tmp/pkgbuild/lang/compiler-rt/work.aarch64eb/compiler-rt-16.0.6.src/lib/xray/xray_function_call_trie.h:20,
                 from /tmp/pkgbuild/lang/compiler-rt/work.aarch64eb/compiler-rt-16.0.6.src/lib/xray/xray_profile_collector.h:20,
                 from /tmp/pkgbuild/lang/compiler-rt/work.aarch64eb/compiler-rt-16.0.6.src/lib/xray/xray_profile_collector.cpp:14:
In member function 'T* __xray::Array<T>::Append(const T&) [with T = const __xray::FunctionCallTrie::Node*]',
    inlined from 'void __xray::profileCollectorService::{anonymous}::populateRecords(__xray::profileCollectorService::{anonymous}::ProfileRecordArray&, __xray::profileCollectorService::ProfileRecord::PathAllocator&, const __xray::FunctionCallTrie&)' at /tmp/pkgbuild/lang/compiler-rt/work.aarch64eb/compiler-rt-16.0.6.src/lib/xray/xray_profile_collector.cpp:192:24,
    inlined from 'void __xray::profileCollectorService::serialize()' at /tmp/pkgbuild/lang/compiler-rt/work.aarch64eb/compiler-rt-16.0.6.src/lib/xray/xray_profile_collector.cpp:279:20:
/tmp/pkgbuild/lang/compiler-rt/work.aarch64eb/compiler-rt-16.0.6.src/lib/xray/xray_segmented_array.h:409:5: warning: writing 8 bytes into a region of size 1 [-Wstringop-overflow=]
In file included from /tmp/pkgbuild/lang/compiler-rt/work.aarch64eb/compiler-rt-16.0.6.src/lib/xray/xray_function_call_trie.h:20,
                 from /tmp/pkgbuild/lang/compiler-rt/work.aarch64eb/compiler-rt-16.0.6.src/lib/xray/xray_profile_collector.h:20,
                 from /tmp/pkgbuild/lang/compiler-rt/work.aarch64eb/compiler-rt-16.0.6.src/lib/xray/xray_profile_collector.cpp:14:
/tmp/pkgbuild/lang/compiler-rt/work.aarch64eb/compiler-rt-16.0.6.src/lib/xray/xray_segmented_array.h: In function 'void __xray::profileCollectorService::serialize()':
/tmp/pkgbuild/lang/compiler-rt/work.aarch64eb/compiler-rt-16.0.6.src/lib/xray/xray_segmented_array.h:37:10: note: at offset 0 to object '__xray::Array<const __xray::FunctionCallTrie::Node*>::Segment::Data' with size 1 declared here
[  1%] Building CXX object lib/xray/CMakeFiles/RTXrayPROFILING.aarch64.dir/xray_profiling.cpp.o
[  2%] Building CXX object lib/orc/CMakeFiles/RTOrc.aarch64.dir/elfnix_platform.cpp.o
[  2%] Building CXX object lib/xray/CMakeFiles/RTXrayPROFILING.aarch64.dir/xray_profiling_flags.cpp.o
[  2%] Built target RTXrayPROFILING.aarch64
[  2%] Building ASM object lib/orc/CMakeFiles/RTOrc.aarch64.dir/elfnix_tls.x86-64.S.o
[  2%] Building ASM object lib/orc/CMakeFiles/RTOrc.aarch64.dir/elfnix_tls.aarch64.S.o
[  2%] Building CXX object lib/fuzzer/CMakeFiles/RTfuzzer.aarch64.dir/FuzzerDriver.cpp.o
[  2%] Building CXX object lib/fuzzer/CMakeFiles/RTfuzzer.aarch64.dir/FuzzerExtFunctionsDlsym.cpp.o
[  2%] Building CXX object lib/fuzzer/CMakeFiles/RTfuzzer.aarch64.dir/FuzzerExtFunctionsWeak.cpp.o
[  2%] Building CXX object lib/fuzzer/CMakeFiles/RTfuzzer.aarch64.dir/FuzzerExtFunctionsWindows.cpp.o
[  2%] Building CXX object lib/fuzzer/CMakeFiles/RTfuzzer.aarch64.dir/FuzzerExtraCounters.cpp.o
[  3%] Building CXX object lib/fuzzer/CMakeFiles/RTfuzzer.aarch64.dir/FuzzerExtraCountersDarwin.cpp.o
[  3%] Building CXX object lib/fuzzer/CMakeFiles/RTfuzzer.aarch64.dir/FuzzerExtraCountersWindows.cpp.o
[  3%] Building CXX object lib/fuzzer/CMakeFiles/RTfuzzer.aarch64.dir/FuzzerFork.cpp.o
[  3%] Built target RTOrc.aarch64
[  4%] Building CXX object lib/xray/CMakeFiles/RTXrayBASIC.aarch64.dir/xray_basic_flags.cpp.o
[  4%] Building CXX object lib/xray/CMakeFiles/RTXrayBASIC.aarch64.dir/xray_basic_logging.cpp.o
[  4%] Built target RTXrayBASIC.aarch64
[  4%] Building CXX object lib/xray/CMakeFiles/RTXrayFDR.aarch64.dir/xray_fdr_flags.cpp.o
[  4%] Building CXX object lib/xray/CMakeFiles/RTXrayFDR.aarch64.dir/xray_fdr_logging.cpp.o
[  4%] Built target RTXrayFDR.aarch64
[  5%] Building CXX object lib/xray/CMakeFiles/RTXray.aarch64.dir/xray_buffer_queue.cpp.o
[  5%] Building CXX object lib/fuzzer/CMakeFiles/RTfuzzer.aarch64.dir/FuzzerIO.cpp.o
[  5%] Building CXX object lib/xray/CMakeFiles/RTXray.aarch64.dir/xray_init.cpp.o
[  5%] Building CXX object lib/xray/CMakeFiles/RTXray.aarch64.dir/xray_flags.cpp.o
[  5%] Building CXX object lib/xray/CMakeFiles/RTXray.aarch64.dir/xray_interface.cpp.o
[  5%] Building CXX object lib/sanitizer_common/CMakeFiles/RTSanitizerCommonLibc.aarch64.dir/sanitizer_common_libcdep.cpp.o
[  5%] Building CXX object lib/xray/CMakeFiles/RTXray.aarch64.dir/xray_log_interface.cpp.o
[  5%] Building CXX object lib/sanitizer_common/CMakeFiles/RTSanitizerCommonLibc.aarch64.dir/sanitizer_allocator_checks.cpp.o
[  5%] Building CXX object lib/sanitizer_common/CMakeFiles/RTSanitizerCommonLibc.aarch64.dir/sanitizer_linux_libcdep.cpp.o
[  5%] Building CXX object lib/fuzzer/CMakeFiles/RTfuzzer.aarch64.dir/FuzzerIOPosix.cpp.o
[  5%] Building CXX object lib/xray/CMakeFiles/RTXray.aarch64.dir/xray_utils.cpp.o
[  5%] Building CXX object lib/sanitizer_common/CMakeFiles/RTSanitizerCommonLibc.aarch64.dir/sanitizer_mac_libcdep.cpp.o
[  5%] Building CXX object lib/sanitizer_common/CMakeFiles/RTSanitizerCommonLibc.aarch64.dir/sanitizer_posix_libcdep.cpp.o
[  6%] Building CXX object lib/sanitizer_common/CMakeFiles/RTSanitizerCommonLibc.aarch64.dir/sanitizer_stoptheworld_linux_libcdep.cpp.o
[  6%] Building CXX object lib/fuzzer/CMakeFiles/RTfuzzer.aarch64.dir/FuzzerIOWindows.cpp.o
[  6%] Building CXX object lib/xray/CMakeFiles/RTXray.aarch64.dir/xray_AArch64.cpp.o
[  6%] Building CXX object lib/sanitizer_common/CMakeFiles/RTSanitizerCommonLibc.aarch64.dir/sanitizer_stoptheworld_netbsd_libcdep.cpp.o
[  6%] Building CXX object lib/fuzzer/CMakeFiles/RTfuzzer.aarch64.dir/FuzzerLoop.cpp.o
[  6%] Building ASM object lib/xray/CMakeFiles/RTXray.aarch64.dir/xray_trampoline_AArch64.S.o
[  6%] Built target RTSanitizerCommonLibc.aarch64
[  6%] Built target RTXray.aarch64
[  6%] Building CXX object lib/sanitizer_common/CMakeFiles/RTSanitizerCommon.aarch64.dir/sanitizer_allocator.cpp.o
[  6%] Building C object lib/profile/CMakeFiles/clang_rt.profile-aarch64.dir/GCDAProfiling.c.o
cc1: warning: command-line option '-nostdinc++' is valid for C++/ObjC++ but not for C
[  6%] Building C object lib/profile/CMakeFiles/clang_rt.profile-aarch64.dir/InstrProfiling.c.o
cc1: warning: command-line option '-nostdinc++' is valid for C++/ObjC++ but not for C
[  6%] Building C object lib/profile/CMakeFiles/clang_rt.profile-aarch64.dir/InstrProfilingInternal.c.o
cc1: warning: command-line option '-nostdinc++' is valid for C++/ObjC++ but not for C
[  7%] Building C object lib/profile/CMakeFiles/clang_rt.profile-aarch64.dir/InstrProfilingValue.c.o
cc1: warning: command-line option '-nostdinc++' is valid for C++/ObjC++ but not for C
[  7%] Building CXX object lib/sanitizer_common/CMakeFiles/RTSanitizerCommon.aarch64.dir/sanitizer_common.cpp.o
[  7%] Building C object lib/profile/CMakeFiles/clang_rt.profile-aarch64.dir/InstrProfilingBuffer.c.o
cc1: warning: command-line option '-nostdinc++' is valid for C++/ObjC++ but not for C
[  7%] Building CXX object lib/sanitizer_common/CMakeFiles/RTSanitizerCommon.aarch64.dir/sanitizer_deadlock_detector1.cpp.o
[  7%] Building C object lib/profile/CMakeFiles/clang_rt.profile-aarch64.dir/InstrProfilingFile.c.o
cc1: warning: command-line option '-nostdinc++' is valid for C++/ObjC++ but not for C
[  7%] Building C object lib/profile/CMakeFiles/clang_rt.profile-aarch64.dir/InstrProfilingMerge.c.o
cc1: warning: command-line option '-nostdinc++' is valid for C++/ObjC++ but not for C
[  7%] Building C object lib/profile/CMakeFiles/clang_rt.profile-aarch64.dir/InstrProfilingMergeFile.c.o
[  7%] Building CXX object lib/sanitizer_common/CMakeFiles/RTSanitizerCommon.aarch64.dir/sanitizer_deadlock_detector2.cpp.o
cc1: warning: command-line option '-nostdinc++' is valid for C++/ObjC++ but not for C
[  8%] Building CXX object lib/sanitizer_common/CMakeFiles/RTSanitizerCommon.aarch64.dir/sanitizer_errno.cpp.o
[  8%] Building CXX object lib/sanitizer_common/CMakeFiles/RTSanitizerCommon.aarch64.dir/sanitizer_file.cpp.o
[  8%] Building C object lib/profile/CMakeFiles/clang_rt.profile-aarch64.dir/InstrProfilingNameVar.c.o
cc1: warning: command-line option '-nostdinc++' is valid for C++/ObjC++ but not for C
[  8%] Building C object lib/profile/CMakeFiles/clang_rt.profile-aarch64.dir/InstrProfilingVersionVar.c.o
cc1: warning: command-line option '-nostdinc++' is valid for C++/ObjC++ but not for C
[  9%] Building C object lib/profile/CMakeFiles/clang_rt.profile-aarch64.dir/InstrProfilingWriter.c.o
cc1: warning: command-line option '-nostdinc++' is valid for C++/ObjC++ but not for C
[  9%] Building CXX object lib/sanitizer_common/CMakeFiles/RTSanitizerCommon.aarch64.dir/sanitizer_flags.cpp.o
[  9%] Building C object lib/profile/CMakeFiles/clang_rt.profile-aarch64.dir/InstrProfilingPlatformDarwin.c.o
cc1: warning: command-line option '-nostdinc++' is valid for C++/ObjC++ but not for C
[  9%] Building C object lib/profile/CMakeFiles/clang_rt.profile-aarch64.dir/InstrProfilingPlatformFuchsia.c.o
cc1: warning: command-line option '-nostdinc++' is valid for C++/ObjC++ but not for C
[  9%] Building CXX object lib/sanitizer_common/CMakeFiles/RTSanitizerCommon.aarch64.dir/sanitizer_flag_parser.cpp.o
[  9%] Building C object lib/profile/CMakeFiles/clang_rt.profile-aarch64.dir/InstrProfilingPlatformLinux.c.o
cc1: warning: command-line option '-nostdinc++' is valid for C++/ObjC++ but not for C
[  9%] Building CXX object lib/sanitizer_common/CMakeFiles/RTSanitizerCommon.aarch64.dir/sanitizer_fuchsia.cpp.o
[  9%] Building C object lib/profile/CMakeFiles/clang_rt.profile-aarch64.dir/InstrProfilingPlatformOther.c.o
[  9%] Building CXX object lib/sanitizer_common/CMakeFiles/RTSanitizerCommon.aarch64.dir/sanitizer_libc.cpp.o
cc1: warning: command-line option '-nostdinc++' is valid for C++/ObjC++ but not for C
[  9%] Building C object lib/profile/CMakeFiles/clang_rt.profile-aarch64.dir/InstrProfilingPlatformWindows.c.o
cc1: warning: command-line option '-nostdinc++' is valid for C++/ObjC++ but not for C
[  9%] Building CXX object lib/profile/CMakeFiles/clang_rt.profile-aarch64.dir/InstrProfilingRuntime.cpp.o
[ 10%] Building C object lib/profile/CMakeFiles/clang_rt.profile-aarch64.dir/InstrProfilingUtil.c.o
cc1: warning: command-line option '-nostdinc++' is valid for C++/ObjC++ but not for C
[ 10%] Building CXX object lib/sanitizer_common/CMakeFiles/RTSanitizerCommon.aarch64.dir/sanitizer_libignore.cpp.o
[ 10%] Linking CXX static library ../netbsd/libclang_rt.profile-aarch64.a
[ 10%] Built target clang_rt.profile-aarch64
[ 10%] Building CXX object lib/ubsan_minimal/CMakeFiles/RTUbsan_minimal.aarch64.dir/ubsan_minimal_handlers.cpp.o
[ 11%] Building CXX object lib/sanitizer_common/CMakeFiles/RTSanitizerCommon.aarch64.dir/sanitizer_linux.cpp.o
[ 11%] Building CXX object lib/fuzzer/CMakeFiles/RTfuzzer.aarch64.dir/FuzzerMerge.cpp.o
distcc[7674] ERROR: compile /tmp/pkgbuild/lang/compiler-rt/work.aarch64eb/compiler-rt-16.0.6.src/lib/sanitizer_common/sanitizer_linux.cpp on 10.0.20.122:3760 failed
distcc[7674] (dcc_build_somewhere) Warning: remote compilation of '/tmp/pkgbuild/lang/compiler-rt/work.aarch64eb/compiler-rt-16.0.6.src/lib/sanitizer_common/sanitizer_linux.cpp' failed, retrying locally
distcc[7674] Warning: failed to distribute /tmp/pkgbuild/lang/compiler-rt/work.aarch64eb/compiler-rt-16.0.6.src/lib/sanitizer_common/sanitizer_linux.cpp to 10.0.20.122:3760, running locally instead
[ 11%] Built target RTUbsan_minimal.aarch64
/tmp/pkgbuild/lang/compiler-rt/work.aarch64eb/compiler-rt-16.0.6.src/lib/sanitizer_common/sanitizer_linux.cpp: In member function '__sanitizer::SignalContext::WriteFlag __sanitizer::SignalContext::GetWriteFlag() const':
/tmp/pkgbuild/lang/compiler-rt/work.aarch64eb/compiler-rt-16.0.6.src/lib/sanitizer_common/sanitizer_linux.cpp:1998:8: error: 'Aarch64GetESR' was not declared in this scope
 1998 |   if (!Aarch64GetESR(ucontext, &esr)) return Unknown;
      |        ^~~~~~~~~~~~~
distcc[7674] ERROR: compile /tmp/pkgbuild/lang/compiler-rt/work.aarch64eb/compiler-rt-16.0.6.src/lib/sanitizer_common/sanitizer_linux.cpp on localhost failed
--- lib/sanitizer_common/CMakeFiles/RTSanitizerCommon.aarch64.dir/sanitizer_linux.cpp.o ---
*** [lib/sanitizer_common/CMakeFiles/RTSanitizerCommon.aarch64.dir/sanitizer_linux.cpp.o] Error code 1

make[2]: stopped in /tmp/pkgbuild/lang/compiler-rt/work.aarch64eb/compiler-rt-16.0.6.src/cmake-pkgsrc-build
1 error

make[2]: stopped in /tmp/pkgbuild/lang/compiler-rt/work.aarch64eb/compiler-rt-16.0.6.src/cmake-pkgsrc-build
--- lib/sanitizer_common/CMakeFiles/RTSanitizerCommon.aarch64.dir/all ---
*** [lib/sanitizer_common/CMakeFiles/RTSanitizerCommon.aarch64.dir/all] Error code 2

make[1]: stopped in /tmp/pkgbuild/lang/compiler-rt/work.aarch64eb/compiler-rt-16.0.6.src/cmake-pkgsrc-build
--- lib/fuzzer/CMakeFiles/RTfuzzer.aarch64.dir/all ---
*** [lib/fuzzer/CMakeFiles/RTfuzzer.aarch64.dir/all] Error code 6

make[1]: stopped in /tmp/pkgbuild/lang/compiler-rt/work.aarch64eb/compiler-rt-16.0.6.src/cmake-pkgsrc-build
[ 11%] Linking CXX static library ../netbsd/libclang_rt.ubsan_minimal-aarch64.a
--- lib/ubsan_minimal/CMakeFiles/clang_rt.ubsan_minimal-aarch64.dir/all ---
*** [lib/ubsan_minimal/CMakeFiles/clang_rt.ubsan_minimal-aarch64.dir/all] Error code 6

make[1]: stopped in /tmp/pkgbuild/lang/compiler-rt/work.aarch64eb/compiler-rt-16.0.6.src/cmake-pkgsrc-build
3 errors

make[1]: stopped in /tmp/pkgbuild/lang/compiler-rt/work.aarch64eb/compiler-rt-16.0.6.src/cmake-pkgsrc-build
*** [all] Error code 2

make: stopped in /tmp/pkgbuild/lang/compiler-rt/work.aarch64eb/compiler-rt-16.0.6.src/cmake-pkgsrc-build
1 error

make: stopped in /tmp/pkgbuild/lang/compiler-rt/work.aarch64eb/compiler-rt-16.0.6.src/cmake-pkgsrc-build
*** Error code 2

Stop.
make[1]: stopped in /usr/pkgsrc/lang/compiler-rt
*** Error code 1

Stop.
make: stopped in /usr/pkgsrc/lang/compiler-rt