=> Bootstrap dependency digest>=20211023: found digest-20220214
===> Skipping vulnerability checks.
WARNING: No /usr/pkg/pkgdb/pkg-vulnerabilities file found.
WARNING: To fix run: `/usr/sbin/pkg_admin -K /usr/pkg/pkgdb fetch-pkg-vulnerabilities'.
===> Building for flycast-2.2
[  0%] Building CXX object core/deps/nowide/CMakeFiles/nowide.dir/src/console_buffer.cpp.o
[  0%] Building C object core/deps/libchdr/deps/lzma-22.01/CMakeFiles/lzma.dir/src/Alloc.c.o
[  0%] Building C object core/deps/libelf/CMakeFiles/elf.dir/src/elf.c.o
[  0%] Building C object core/deps/libchdr/deps/lzma-22.01/CMakeFiles/lzma.dir/src/Bra86.c.o
[  0%] Building C object core/deps/libelf/CMakeFiles/elf.dir/src/elf32.c.o
[  1%] Building C object core/deps/libchdr/deps/lzma-22.01/CMakeFiles/lzma.dir/src/BraIA64.c.o
[  2%] Building C object core/deps/libelf/CMakeFiles/elf.dir/src/elf64.c.o
[  2%] Building C object core/deps/libchdr/deps/lzma-22.01/CMakeFiles/lzma.dir/src/CpuArch.c.o
/tmp/pkgbuild/emulators/flycast/work.aarch64eb/flycast-2.2/core/deps/libchdr/deps/lzma-22.01/src/CpuArch.c:428:10: fatal error: sys/auxv.h: No such file or directory
  428 | #include <sys/auxv.h>
      |          ^~~~~~~~~~~~
compilation terminated.
distcc[13163] ERROR: compile /tmp/pkgbuild/emulators/flycast/work.aarch64eb/flycast-2.2/core/deps/libchdr/deps/lzma-22.01/src/CpuArch.c on 10.0.20.122:3760 failed
distcc[13163] (dcc_build_somewhere) Warning: remote compilation of '/tmp/pkgbuild/emulators/flycast/work.aarch64eb/flycast-2.2/core/deps/libchdr/deps/lzma-22.01/src/CpuArch.c' failed, retrying locally
distcc[13163] Warning: failed to distribute /tmp/pkgbuild/emulators/flycast/work.aarch64eb/flycast-2.2/core/deps/libchdr/deps/lzma-22.01/src/CpuArch.c to 10.0.20.122:3760, running locally instead
/tmp/pkgbuild/emulators/flycast/work.aarch64eb/flycast-2.2/core/deps/libchdr/deps/lzma-22.01/src/CpuArch.c:428:10: fatal error: sys/auxv.h: No such file or directory
  428 | #include <sys/auxv.h>
      |          ^~~~~~~~~~~~
compilation terminated.
distcc[13163] ERROR: compile /tmp/pkgbuild/emulators/flycast/work.aarch64eb/flycast-2.2/core/deps/libchdr/deps/lzma-22.01/src/CpuArch.c on localhost failed
--- core/deps/libchdr/deps/lzma-22.01/CMakeFiles/lzma.dir/src/CpuArch.c.o ---
*** [core/deps/libchdr/deps/lzma-22.01/CMakeFiles/lzma.dir/src/CpuArch.c.o] Error code 1

make[2]: stopped in /tmp/pkgbuild/emulators/flycast/work.aarch64eb/flycast-2.2
1 error

make[2]: stopped in /tmp/pkgbuild/emulators/flycast/work.aarch64eb/flycast-2.2
--- core/deps/libchdr/deps/lzma-22.01/CMakeFiles/lzma.dir/all ---
*** [core/deps/libchdr/deps/lzma-22.01/CMakeFiles/lzma.dir/all] Error code 2

make[1]: stopped in /tmp/pkgbuild/emulators/flycast/work.aarch64eb/flycast-2.2
--- core/deps/nowide/CMakeFiles/nowide.dir/all ---
*** [core/deps/nowide/CMakeFiles/nowide.dir/all] Error code 6

make[1]: stopped in /tmp/pkgbuild/emulators/flycast/work.aarch64eb/flycast-2.2
--- core/deps/libelf/CMakeFiles/elf.dir/all ---
*** [core/deps/libelf/CMakeFiles/elf.dir/all] Error code 6

make[1]: stopped in /tmp/pkgbuild/emulators/flycast/work.aarch64eb/flycast-2.2
3 errors

make[1]: stopped in /tmp/pkgbuild/emulators/flycast/work.aarch64eb/flycast-2.2
*** [all] Error code 2

make: stopped in /tmp/pkgbuild/emulators/flycast/work.aarch64eb/flycast-2.2
1 error

make: stopped in /tmp/pkgbuild/emulators/flycast/work.aarch64eb/flycast-2.2
*** Error code 2

Stop.
make[1]: stopped in /usr/pkgsrc/emulators/flycast
*** Error code 1

Stop.
make: stopped in /usr/pkgsrc/emulators/flycast