=> Bootstrap dependency digest>=20211023: found digest-20220214
===> Skipping vulnerability checks.
WARNING: No /usr/pkg/pkgdb/pkg-vulnerabilities file found.
WARNING: To fix run: `/usr/sbin/pkg_admin -K /usr/pkg/pkgdb fetch-pkg-vulnerabilities'.
===> Building for lavaps-2.7nb20
/usr/pkg/bin/gmake  all-recursive
gmake[1]: Entering directory '/tmp/pkgbuild/sysutils/lavaps/work.aarch64eb/lavaps-2.7'
Making all in doc
gmake[2]: Entering directory '/tmp/pkgbuild/sysutils/lavaps/work.aarch64eb/lavaps-2.7/doc'
gmake[3]: Entering directory '/tmp/pkgbuild/sysutils/lavaps/work.aarch64eb/lavaps-2.7/doc'
/usr/pkg/bin/perl podprune LAVAPS "WHAT'S NEW" REQUIREMENTS "INSTALLATION DETAILS" AVAILABILITY "RELEASE HISTORY" ISPELL <master.pod >lavaps.pod
/tmp/pkgbuild/sysutils/lavaps/work.aarch64eb/.tools/bin/pod2man --section=1 --release="lavaps-2.7" --center="Lavaps Documentation" lavaps.pod >lavaps.1
rm lavaps.pod
gmake[3]: Leaving directory '/tmp/pkgbuild/sysutils/lavaps/work.aarch64eb/lavaps-2.7/doc'
/usr/pkg/bin/perl podprune LAVAPS "WHAT'S NEW" REQUIREMENTS "INSTALLATION DETAILS" AVAILABILITY "RELEASE HISTORY" ISPELL  <master.pod >lavaps.pod
/tmp/pkgbuild/sysutils/lavaps/work.aarch64eb/.tools/bin/pod2html --title "lavaps-2.7 manual page" lavaps.pod >lavaps_man.html
rm lavaps.pod
gmake[2]: Leaving directory '/tmp/pkgbuild/sysutils/lavaps/work.aarch64eb/lavaps-2.7/doc'
Making all in po
gmake[2]: Entering directory '/tmp/pkgbuild/sysutils/lavaps/work.aarch64eb/lavaps-2.7/po'
gmake[2]: Nothing to be done for 'all'.
gmake[2]: Leaving directory '/tmp/pkgbuild/sysutils/lavaps/work.aarch64eb/lavaps-2.7/po'
Making all in tcl2cc
gmake[2]: Entering directory '/tmp/pkgbuild/sysutils/lavaps/work.aarch64eb/lavaps-2.7/tcl2cc'
if gcc -DHAVE_CONFIG_H -I. -I. -I..   -DPNG_NO_ASSEMBLER_CODE -I/usr/pkg/include -I/usr/X11R7/include -I/usr/include -I/usr/pkg/include/freetype2  -I/usr/X11R7/include  -I/usr/local/include/tk -I/usr/local/include/tcl -L/usr/local/lib  -O2 -D_KMEMUSER -I/usr/pkg/include -I/usr/X11R7/include -I/usr/include -I/usr/pkg/include/freetype2 -MT tcl2cc.o -MD -MP -MF ".deps/tcl2cc.Tpo" -c -o tcl2cc.o tcl2cc.c; \
then mv -f ".deps/tcl2cc.Tpo" ".deps/tcl2cc.Po"; else rm -f ".deps/tcl2cc.Tpo"; exit 1; fi
tcl2cc.c: In function 'main':
tcl2cc.c:220:3: warning: implicit declaration of function 'exit' [-Wimplicit-function-declaration]
tcl2cc.c:220:3: warning: incompatible implicit declaration of built-in function 'exit'
tcl2cc.c:219:1: note: include '<stdlib.h>' or provide a declaration of 'exit'
tcl2cc.c:241:5: warning: incompatible implicit declaration of built-in function 'exit'
tcl2cc.c:234:1: note: include '<stdlib.h>' or provide a declaration of 'exit'
gcc  -O2 -D_KMEMUSER -I/usr/pkg/include -I/usr/X11R7/include -I/usr/include -I/usr/pkg/include/freetype2  -Wl,-zrelro -L/usr/pkg/lib -Wl,-R/usr/pkg/lib -L/usr/X11R7/lib -Wl,-R/usr/X11R7/lib -L/usr/lib -Wl,-R/usr/lib -o tcl2cc  tcl2cc.o  
gmake[2]: Leaving directory '/tmp/pkgbuild/sysutils/lavaps/work.aarch64eb/lavaps-2.7/tcl2cc'
Making all in src
gmake[2]: Entering directory '/tmp/pkgbuild/sysutils/lavaps/work.aarch64eb/lavaps-2.7/src'
gmake[3]: Entering directory '/tmp/pkgbuild/sysutils/lavaps/work.aarch64eb/lavaps-2.7/src'
if c++ -DHAVE_CONFIG_H -I. -I. -I..   -DPNG_NO_ASSEMBLER_CODE -I/usr/pkg/include -I/usr/X11R7/include -I/usr/include -I/usr/pkg/include/freetype2  -I/usr/X11R7/include  -I/usr/local/include/tk -I/usr/local/include/tcl -L/usr/local/lib  -DUSE_TCL_BLOB -I/usr/local/include/tk -I/usr/local/include/tcl -L/usr/local/lib -DUSE_PROCESS_SCAN_BSD -fpermissive -g   -Wall -DLAVAPS_STL_NAMESPACE=std -I/usr/X11R7/include -DGNOMELOCALEDIR=\""/usr/pkg/share/locale"\" -O2 -D_KMEMUSER -I/usr/pkg/include -I/usr/X11R7/include -I/usr/include -I/usr/pkg/include/freetype2 -MT main.o -MD -MP -MF ".deps/main.Tpo" -c -o main.o main.cc; \
then mv -f ".deps/main.Tpo" ".deps/main.Po"; else rm -f ".deps/main.Tpo"; exit 1; fi
if c++ -DHAVE_CONFIG_H -I. -I. -I..   -DPNG_NO_ASSEMBLER_CODE -I/usr/pkg/include -I/usr/X11R7/include -I/usr/include -I/usr/pkg/include/freetype2  -I/usr/X11R7/include  -I/usr/local/include/tk -I/usr/local/include/tcl -L/usr/local/lib  -DUSE_TCL_BLOB -I/usr/local/include/tk -I/usr/local/include/tcl -L/usr/local/lib -DUSE_PROCESS_SCAN_BSD -fpermissive -g   -Wall -DLAVAPS_STL_NAMESPACE=std -I/usr/X11R7/include -DGNOMELOCALEDIR=\""/usr/pkg/share/locale"\" -O2 -D_KMEMUSER -I/usr/pkg/include -I/usr/X11R7/include -I/usr/include -I/usr/pkg/include/freetype2 -MT process_view.o -MD -MP -MF ".deps/process_view.Tpo" -c -o process_view.o process_view.cc; \
then mv -f ".deps/process_view.Tpo" ".deps/process_view.Po"; else rm -f ".deps/process_view.Tpo"; exit 1; fi
if c++ -DHAVE_CONFIG_H -I. -I. -I..   -DPNG_NO_ASSEMBLER_CODE -I/usr/pkg/include -I/usr/X11R7/include -I/usr/include -I/usr/pkg/include/freetype2  -I/usr/X11R7/include  -I/usr/local/include/tk -I/usr/local/include/tcl -L/usr/local/lib  -DUSE_TCL_BLOB -I/usr/local/include/tk -I/usr/local/include/tcl -L/usr/local/lib -DUSE_PROCESS_SCAN_BSD -fpermissive -g   -Wall -DLAVAPS_STL_NAMESPACE=std -I/usr/X11R7/include -DGNOMELOCALEDIR=\""/usr/pkg/share/locale"\" -O2 -D_KMEMUSER -I/usr/pkg/include -I/usr/X11R7/include -I/usr/include -I/usr/pkg/include/freetype2 -MT process_model.o -MD -MP -MF ".deps/process_model.Tpo" -c -o process_model.o process_model.cc; \
then mv -f ".deps/process_model.Tpo" ".deps/process_model.Po"; else rm -f ".deps/process_model.Tpo"; exit 1; fi
if c++ -DHAVE_CONFIG_H -I. -I. -I..   -DPNG_NO_ASSEMBLER_CODE -I/usr/pkg/include -I/usr/X11R7/include -I/usr/include -I/usr/pkg/include/freetype2  -I/usr/X11R7/include  -I/usr/local/include/tk -I/usr/local/include/tcl -L/usr/local/lib  -DUSE_TCL_BLOB -I/usr/local/include/tk -I/usr/local/include/tcl -L/usr/local/lib -DUSE_PROCESS_SCAN_BSD -fpermissive -g   -Wall -DLAVAPS_STL_NAMESPACE=std -I/usr/X11R7/include -DGNOMELOCALEDIR=\""/usr/pkg/share/locale"\" -O2 -D_KMEMUSER -I/usr/pkg/include -I/usr/X11R7/include -I/usr/include -I/usr/pkg/include/freetype2 -MT process_list.o -MD -MP -MF ".deps/process_list.Tpo" -c -o process_list.o process_list.cc; \
then mv -f ".deps/process_list.Tpo" ".deps/process_list.Po"; else rm -f ".deps/process_list.Tpo"; exit 1; fi
if c++ -DHAVE_CONFIG_H -I. -I. -I..   -DPNG_NO_ASSEMBLER_CODE -I/usr/pkg/include -I/usr/X11R7/include -I/usr/include -I/usr/pkg/include/freetype2  -I/usr/X11R7/include  -I/usr/local/include/tk -I/usr/local/include/tcl -L/usr/local/lib  -DUSE_TCL_BLOB -I/usr/local/include/tk -I/usr/local/include/tcl -L/usr/local/lib -DUSE_PROCESS_SCAN_BSD -fpermissive -g   -Wall -DLAVAPS_STL_NAMESPACE=std -I/usr/X11R7/include -DGNOMELOCALEDIR=\""/usr/pkg/share/locale"\" -O2 -D_KMEMUSER -I/usr/pkg/include -I/usr/X11R7/include -I/usr/include -I/usr/pkg/include/freetype2 -MT process_scan_linux_proc.o -MD -MP -MF ".deps/process_scan_linux_proc.Tpo" -c -o process_scan_linux_proc.o process_scan_linux_proc.cc; \
then mv -f ".deps/process_scan_linux_proc.Tpo" ".deps/process_scan_linux_proc.Po"; else rm -f ".deps/process_scan_linux_proc.Tpo"; exit 1; fi
if c++ -DHAVE_CONFIG_H -I. -I. -I..   -DPNG_NO_ASSEMBLER_CODE -I/usr/pkg/include -I/usr/X11R7/include -I/usr/include -I/usr/pkg/include/freetype2  -I/usr/X11R7/include  -I/usr/local/include/tk -I/usr/local/include/tcl -L/usr/local/lib  -DUSE_TCL_BLOB -I/usr/local/include/tk -I/usr/local/include/tcl -L/usr/local/lib -DUSE_PROCESS_SCAN_BSD -fpermissive -g   -Wall -DLAVAPS_STL_NAMESPACE=std -I/usr/X11R7/include -DGNOMELOCALEDIR=\""/usr/pkg/share/locale"\" -O2 -D_KMEMUSER -I/usr/pkg/include -I/usr/X11R7/include -I/usr/include -I/usr/pkg/include/freetype2 -MT process_scan_bsd.o -MD -MP -MF ".deps/process_scan_bsd.Tpo" -c -o process_scan_bsd.o process_scan_bsd.cc; \
then mv -f ".deps/process_scan_bsd.Tpo" ".deps/process_scan_bsd.Po"; else rm -f ".deps/process_scan_bsd.Tpo"; exit 1; fi
process_scan_bsd.cc:254:8: error: #error No UPAGES, no USPACE, no fun!
  254 | #      error No UPAGES, no USPACE, no fun!
      |        ^~~~~
distcc[1006] ERROR: compile process_scan_bsd.cc on 10.0.20.122:3760 failed
distcc[1006] (dcc_build_somewhere) Warning: remote compilation of 'process_scan_bsd.cc' failed, retrying locally
distcc[1006] Warning: failed to distribute process_scan_bsd.cc to 10.0.20.122:3760, running locally instead
process_scan_bsd.cc:254:8: error: #error No UPAGES, no USPACE, no fun!
  254 | #      error No UPAGES, no USPACE, no fun!
      |        ^~~~~
process_scan_bsd.cc: In member function 'int process_scan_bsd::extract_size_kb()':
process_scan_bsd.cc:262:21: error: 'UPAGES' was not declared in this scope
  262 |  return pages_to_kb(UPAGES + cur_kp_->kp_eproc.e_vm.vm_tsize
      |                     ^~~~~~
process_scan_bsd.cc: In member function 'int process_scan_bsd::extract_rssize_kb()':
process_scan_bsd.cc:266:64: error: 'UPAGES' was not declared in this scope
  266 | int process_scan_bsd::extract_rssize_kb() { return pages_to_kb(UPAGES + cur_kp_->kp_eproc.e_vm.vm_rssize); }
      |                                                                ^~~~~~
distcc[1006] ERROR: compile process_scan_bsd.cc on localhost failed
gmake[3]: *** [Makefile:458: process_scan_bsd.o] Error 1
gmake[3]: Leaving directory '/tmp/pkgbuild/sysutils/lavaps/work.aarch64eb/lavaps-2.7/src'
gmake[2]: *** [Makefile:498: all-recursive] Error 1
gmake[2]: Leaving directory '/tmp/pkgbuild/sysutils/lavaps/work.aarch64eb/lavaps-2.7/src'
gmake[1]: *** [Makefile:315: all-recursive] Error 1
gmake[1]: Leaving directory '/tmp/pkgbuild/sysutils/lavaps/work.aarch64eb/lavaps-2.7'
gmake: *** [Makefile:258: all] Error 2
*** Error code 2

Stop.
make[1]: stopped in /usr/pkgsrc/sysutils/lavaps
*** Error code 1

Stop.
make: stopped in /usr/pkgsrc/sysutils/lavaps