=> Bootstrap dependency digest>=20211023: found digest-20220214
===> Skipping vulnerability checks.
WARNING: No /usr/pkg/pkgdb/pkg-vulnerabilities file found.
WARNING: To fix run: `/usr/sbin/pkg_admin -K /usr/pkg/pkgdb fetch-pkg-vulnerabilities'.
===> Building for libgda-mysql-5.2.9nb12
gcc -o gen_def -DIMPOSED_HEADER=\""../../../libgda/sql-parser/token_types.h"\" ./gen_def.c
gcc -O2 -I/usr/pkg/include -I/usr/pkg/include/glib-2.0 -I/usr/pkg/include/gio-unix-2.0 -I/usr/pkg/lib/glib-2.0/include -I/usr/include -I/usr/include/readline -I/usr/pkg/include/mysql -I/usr/pkg/include -I/usr/pkg/include/glib-2.0 -I/usr/pkg/include/gio-unix-2.0 -I/usr/pkg/lib/glib-2.0/include -I/usr/include -I/usr/include/readline -I/usr/pkg/include/mysql -Wl,-zrelro -L/usr/pkg/lib -Wl,-R/usr/pkg/lib -L/usr/lib -Wl,-R/usr/lib  ../../../libgda/sql-parser/lemon.c   -o ../../../libgda/sql-parser/lemon
gcc -o mkkeywordhash  ../../../libgda/sqlite/mkkeywordhash.c
./mkkeywordhash ../../../providers/reuseable/mysql/keywords_V50.list V50 > keywords_hash.c
./mkkeywordhash ../../../providers/reuseable/mysql/keywords_V51.list V51 >> keywords_hash.c
./mkkeywordhash ../../../providers/reuseable/mysql/keywords_V54.list V54 >> keywords_hash.c
./mkkeywordhash ../../../providers/reuseable/mysql/keywords_V60.list V60 >> keywords_hash.c
../../../libgda/sql-parser/lemon -q -d -T../../../libgda/sql-parser/lempar.c ./parser.y
../../../libgda/sql-parser/lemon -q -d -T../../../libgda/sql-parser/lempar.c ./parser.y
3 parsing conflicts.
3 parsing conflicts.
gmake: [Makefile:815: parser.h] Error 1 (ignored)
gmake: [Makefile:815: parser.c] Error 1 (ignored)
./gen_def > mysql_token_types.h
  CC       gda-mysql-reuseable.lo
  CC       gda-mysql-parser.lo
  CC       gda-mysql-meta.lo
  CC       parser.lo
distcc[20574] ERROR: compile parser.c on 10.0.20.122:3760 failed
distcc[20574] (dcc_build_somewhere) Warning: remote compilation of 'parser.c' failed, retrying locally
distcc[20574] Warning: failed to distribute parser.c to 10.0.20.122:3760, running locally instead
./parser.y: In function 'yy_destructor':
./parser.y:478:16: error: 'YYMINORTYPE' has no member named 'yy'; did you mean 'yy0'?
  478 | %destructor inscollist_opt {if ($$) {g_slist_foreach ($$, (GFunc) gda_sql_field_free, NULL); g_slist_free ($$);}}
      |                ^~
      |                yy0
./parser.y:478:53: error: 'YYMINORTYPE' has no member named 'yy'; did you mean 'yy0'?
  478 | %destructor inscollist_opt {if ($$) {g_slist_foreach ($$, (GFunc) gda_sql_field_free, NULL); g_slist_free ($$);}}
      |                                                     ^~
      |                                                     yy0
./parser.y:478:121: error: 'YYMINORTYPE' has no member named 'yy'; did you mean 'yy0'?
  478 | %destructor inscollist_opt {if ($$) {g_slist_foreach ($$, (GFunc) gda_sql_field_free, NULL); g_slist_free ($$);}}
      |                                                                                                                         ^ 
      |                                                                                                                         yy0
./parser.y:468:26: error: 'YYMINORTYPE' has no member named 'yy'; did you mean 'yy0'?
  468 |   for (list = $$; list; list = list->next) {
      |                          ^~
      |                          yy0
./parser.y:472:28: error: 'YYMINORTYPE' has no member named 'yy'; did you mean 'yy0'?
  472 |   g_slist_free ($$);
      |                            ^ 
      |                            yy0
./parser.y:521:25: error: 'YYMINORTYPE' has no member named 'yy'; did you mean 'yy0'?
  521 |  for (list = $$; list; list = list->next) {
      |                         ^~
      |                         yy0
./parser.y:527:27: error: 'YYMINORTYPE' has no member named 'yy'; did you mean 'yy0'?
  527 |  g_slist_free ($$);
      |                           ^ 
      |                           yy0
./parser.y:633:38: error: 'YYMINORTYPE' has no member named 'yy'; did you mean 'yy0'?
  633 | %destructor from {gda_sql_select_from_free ($$);}
      |                                      ^~
      |                                      yy0
./parser.y:628:16: error: 'YYMINORTYPE' has no member named 'yy'; did you mean 'yy0'?
  628 | %destructor groupby_opt {if ($$) {g_slist_foreach ($$, (GFunc) gda_sql_expr_free, NULL); g_slist_free ($$);}}
      |                ^~
      |                yy0
./parser.y:628:53: error: 'YYMINORTYPE' has no member named 'yy'; did you mean 'yy0'?
  628 | %destructor groupby_opt {if ($$) {g_slist_foreach ($$, (GFunc) gda_sql_expr_free, NULL); g_slist_free ($$);}}
      |                                                     ^~
      |                                                     yy0
./parser.y:628:120: error: 'YYMINORTYPE' has no member named 'yy'; did you mean 'yy0'?
  628 | %destructor groupby_opt {if ($$) {g_slist_foreach ($$, (GFunc) gda_sql_expr_free, NULL); g_slist_free ($$);}}
      |                                                                                                                        ^ 
      |                                                                                                                        yy0
./parser.y: In function 'yy_reduce':
./parser.y:440:80: error: 'YYMINORTYPE' has no member named 'yy'; did you mean 'yy0'?
  440 |  gda_sql_statement_insert_take_fields_list (C, F);
      |                                                                                ^ 
      |                                                                                yy0
./parser.y:448:80: error: 'YYMINORTYPE' has no member named 'yy'; did you mean 'yy0'?
  448 |  gda_sql_statement_insert_take_fields_list (C, F);
      |                                                                                ^ 
      |                                                                                yy0
./parser.y:450:85: error: 'YYMINORTYPE' has no member named 'yy'; did you mean 'yy0'?
  450 |  gda_sql_statement_insert_take_extra_values_list (C, E);
      |                                                                                     ^ 
      |                                                                                     yy0
./parser.y:457:87: error: 'YYMINORTYPE' has no member named 'yy'; did you mean 'yy0'?
  457 |         gda_sql_statement_insert_take_fields_list (C, F);
      |                                                                                       ^ 
      |                                                                                       yy0
./parser.y:474:14: error: 'YYMINORTYPE' has no member named 'yy'; did you mean 'yy0'?
  474 | ins_extra_values(E) ::= ins_extra_values(A) COMMA LP rexprlist(L) RP. {E = g_slist_append (A, g_slist_reverse (L));}
      |              ^~
      |              yy0
./parser.y:474:54: error: 'YYMINORTYPE' has no member named 'yy'; did you mean 'yy0'?
  474 | ins_extra_values(E) ::= ins_extra_values(A) COMMA LP rexprlist(L) RP. {E = g_slist_append (A, g_slist_reverse (L));}
      |                                                      ^~
      |                                                      yy0
./parser.y:475:14: error: 'YYMINORTYPE' has no member named 'yy'; did you mean 'yy0'?
  475 | ins_extra_values(E) ::= COMMA LP rexprlist(L) RP. {E = g_slist_append (NULL, g_slist_reverse (L));}
      |              ^~
      |              yy0
./parser.y:479:14: error: 'YYMINORTYPE' has no member named 'yy'; did you mean 'yy0'?
  479 | inscollist_opt(A) ::= .                       {A = NULL;}
      |              ^~
      |              yy0
./parser.y:480:14: error: 'YYMINORTYPE' has no member named 'yy'; did you mean 'yy0'?
  480 | inscollist_opt(A) ::= LP inscollist(X) RP.    {A = X;}
      |              ^~
      |              yy0
./parser.y:480:38: error: 'YYMINORTYPE' has no member named 'yy'; did you mean 'yy0'?
  480 | inscollist_opt(A) ::= LP inscollist(X) RP.    {A = X;}
      |                                      ^~
      |                                      yy0
./parser.y:487:23: error: 'YYMINORTYPE' has no member named 'yy'; did you mean 'yy0'?
  487 |           A = g_slist_append (X, field);
      |                       ^~
      |                       yy0
./parser.y:487:63: error: 'YYMINORTYPE' has no member named 'yy'; did you mean 'yy0'?
  487 |           A = g_slist_append (X, field);
      |                                                               ^ 
      |                                                               yy0
./parser.y:491:17: error: 'YYMINORTYPE' has no member named 'yy'; did you mean 'yy0'?
  491 |     A = g_slist_prepend (NULL, field);
      |                 ^~
      |                 yy0
./parser.y:511:30: error: 'YYMINORTYPE' has no member named 'yy'; did you mean 'yy0'?
  511 |  for (list = S; list; list = list->next) {
      |                              ^~
      |                              yy0
./parser.y:516:32: error: 'YYMINORTYPE' has no member named 'yy'; did you mean 'yy0'?
  516 |  g_slist_free (S);
      |                                ^ 
      |                                yy0
./parser.y:533:21: error: 'YYMINORTYPE' has no member named 'yy'; did you mean 'yy0'?
  533 |         A = g_slist_append (Z, set);
      |                     ^~
      |                     yy0
./parser.y:533:61: error: 'YYMINORTYPE' has no member named 'yy'; did you mean 'yy0'?
  533 |         A = g_slist_append (Z, set);
      |                                                             ^ 
      |                                                             yy0
./parser.y:539:18: error: 'YYMINORTYPE' has no member named 'yy'; did you mean 'yy0'?
  539 |      A = g_slist_append (NULL, set);
      |                  ^~
      |                  yy0
./parser.y:581:73: error: 'YYMINORTYPE' has no member named 'yy'; did you mean 'yy0'?
  581 |  gda_sql_statement_select_take_from (C, F);
      |                                                                         ^ 
      |                                                                         yy0
./parser.y:583:77: error: 'YYMINORTYPE' has no member named 'yy'; did you mean 'yy0'?
  583 |  gda_sql_statement_select_take_group_by (C, P);
      |                                                                             ^ 
      |                                                                             yy0
./parser.y:629:14: error: 'YYMINORTYPE' has no member named 'yy'; did you mean 'yy0'?
  629 | groupby_opt(A) ::= .                      {A = 0;}
      |              ^~
      |              yy0
./parser.y:630:14: error: 'YYMINORTYPE' has no member named 'yy'; did you mean 'yy0'?
  630 | groupby_opt(A) ::= GROUP BY rnexprlist(X). {A = g_slist_reverse (X);}
      |              ^~
      |              yy0
./parser.y:634:14: error: 'YYMINORTYPE' has no member named 'yy'; did you mean 'yy0'?
  634 | from(F) ::= .                   {F = NULL;}
      |              ^~
      |              yy0
./parser.y:635:14: error: 'YYMINORTYPE' has no member named 'yy'; did you mean 'yy0'?
  635 | from(F) ::= FROM seltablist(X). {F = X;}
      |              ^~
      |              yy0
./parser.y:635:38: error: 'YYMINORTYPE' has no member named 'yy'; did you mean 'yy0'?
  635 | from(F) ::= FROM seltablist(X). {F = X;}
      |                                      ^~
      |                                      yy0
./parser.y:644:22: error: 'YYMINORTYPE' has no member named 'yy'; did you mean 'yy0'?
  644 |  if (P)
      |                      ^ 
      |                      yy0
./parser.y:645:15: error: 'YYMINORTYPE' has no member named 'yy'; did you mean 'yy0'?
  645 |   L = P;
      |               ^ 
      |               yy0
./parser.y:645:40: error: 'YYMINORTYPE' has no member named 'yy'; did you mean 'yy0'?
  645 |   L = P;
      |                                        ^ 
      |                                        yy0
./parser.y:647:15: error: 'YYMINORTYPE' has no member named 'yy'; did you mean 'yy0'?
  647 |   L = gda_sql_select_from_new (NULL);
      |               ^~
      |               yy0
./parser.y:648:51: error: 'YYMINORTYPE' has no member named 'yy'; did you mean 'yy0'?
  648 |  gda_sql_select_from_take_new_target (L, T);
      |                                                   ^ 
      |                                                   yy0
./parser.y:649:35: error: 'YYMINORTYPE' has no member named 'yy'; did you mean 'yy0'?
  649 |  last = g_slist_last (L->joins);
      |                                   ^ 
      |                                   yy0
./parser.y:649:41: error: invalid type argument of '->' (have 'int')
  649 |  last = g_slist_last (L->joins);
      |                                         ^ 
./parser.y:653:48: error: 'YYMINORTYPE' has no member named 'yy'; did you mean 'yy0'?
  653 |   join->position = g_slist_length (L->targets) - 1;
      |                                                ^~
      |                                                yy0
./parser.y:653:54: error: invalid type argument of '->' (have 'int')
  653 |   join->position = g_slist_length (L->targets) - 1;
      |                                                      ^ 
./parser.y:654:30: error: 'YYMINORTYPE' has no member named 'yy'; did you mean 'yy0'?
  654 |   join->use = U;
      |                              ^ 
      |                              yy0
./parser.y:660:14: error: 'YYMINORTYPE' has no member named 'yy'; did you mean 'yy0'?
  660 | using_opt(U) ::= USING LP inscollist(L) RP. {U = L;}
      |              ^~
      |              yy0
./parser.y:660:38: error: 'YYMINORTYPE' has no member named 'yy'; did you mean 'yy0'?
  660 | using_opt(U) ::= USING LP inscollist(L) RP. {U = L;}
      |                                      ^~
      |                                      yy0
./parser.y:665:24: error: 'YYMINORTYPE' has no member named 'yy'; did you mean 'yy0'?
  665 |            P = L;
      |                        ^ 
      |                        yy0
./parser.y:665:49: error: 'YYMINORTYPE' has no member named 'yy'; did you mean 'yy0'?
  665 |            P = L;
      |                                                 ^ 
      |                                                 yy0
In file included from ../../../libgda/sql-parser/gda-statement-struct.h:26,
                 from ../../../libgda/gda-statement.h:25,
                 from ../../../libgda/sql-parser/gda-sql-parser.h:25,
                 from ../../../libgda/sql-parser/gda-sql-parser-private.h:25,
                 from ./parser.y:41:
./parser.y:666:74: error: 'YYMINORTYPE' has no member named 'yy'; did you mean 'yy0'?
  666 |            join = gda_sql_select_join_new (GDA_SQL_ANY_PART (P));
      |                                                                          ^ 
../../../libgda/sql-parser/gda-statement-struct-decl.h:216:47: note: in definition of macro 'GDA_SQL_ANY_PART'
  216 | #define GDA_SQL_ANY_PART(x) ((GdaSqlAnyPart*)(x))
      |                                               ^
./parser.y:667:40: error: 'YYMINORTYPE' has no member named 'yy'; did you mean 'yy0'?
  667 |            join->type = J;
      |                                        ^ 
      |                                        yy0
./parser.y:668:59: error: 'YYMINORTYPE' has no member named 'yy'; did you mean 'yy0'?
  668 |            gda_sql_select_from_take_new_join (P, join);
      |                                                           ^ 
      |                                                           yy0
./parser.y:678:14: error: 'YYMINORTYPE' has no member named 'yy'; did you mean 'yy0'?
  678 | jointype(J) ::= COMMA. {J = GDA_SQL_SELECT_JOIN_CROSS;}
      |              ^~
      |              yy0
./parser.y:679:14: error: 'YYMINORTYPE' has no member named 'yy'; did you mean 'yy0'?
  679 | jointype(J) ::= JOIN. {J = GDA_SQL_SELECT_JOIN_INNER;}
      |              ^~
      |              yy0
./parser.y:680:14: error: 'YYMINORTYPE' has no member named 'yy'; did you mean 'yy0'?
  680 | jointype(J) ::= CROSS JOIN. {J = GDA_SQL_SELECT_JOIN_CROSS;}
      |              ^~
      |              yy0
./parser.y:681:14: error: 'YYMINORTYPE' has no member named 'yy'; did you mean 'yy0'?
  681 | jointype(J) ::= INNER JOIN. {J = GDA_SQL_SELECT_JOIN_INNER;}
      |              ^~
      |              yy0
./parser.y:682:14: error: 'YYMINORTYPE' has no member named 'yy'; did you mean 'yy0'?
  682 | jointype(J) ::= NATURAL JOIN. {J = GDA_SQL_SELECT_JOIN_NATURAL;}
      |              ^~
      |              yy0
./parser.y:683:14: error: 'YYMINORTYPE' has no member named 'yy'; did you mean 'yy0'?
  683 | jointype(J) ::= LEFT JOIN. {J = GDA_SQL_SELECT_JOIN_LEFT;}
      |              ^~
      |              yy0
./parser.y:684:14: error: 'YYMINORTYPE' has no member named 'yy'; did you mean 'yy0'?
  684 | jointype(J) ::= LEFT OUTER JOIN. {J = GDA_SQL_SELECT_JOIN_LEFT;}
      |              ^~
      |              yy0
./parser.y:685:14: error: 'YYMINORTYPE' has no member named 'yy'; did you mean 'yy0'?
  685 | jointype(J) ::= RIGHT JOIN. {J = GDA_SQL_SELECT_JOIN_RIGHT;}
      |              ^~
      |              yy0
./parser.y:686:14: error: 'YYMINORTYPE' has no member named 'yy'; did you mean 'yy0'?
  686 | jointype(J) ::= RIGHT OUTER JOIN. {J = GDA_SQL_SELECT_JOIN_RIGHT;}
      |              ^~
      |              yy0
./parser.y:687:14: error: 'YYMINORTYPE' has no member named 'yy'; did you mean 'yy0'?
  687 | jointype(J) ::= FULL JOIN. {J = GDA_SQL_SELECT_JOIN_FULL;}
      |              ^~
      |              yy0
./parser.y:688:14: error: 'YYMINORTYPE' has no member named 'yy'; did you mean 'yy0'?
  688 | jointype(J) ::= FULL OUTER JOIN. {J = GDA_SQL_SELECT_JOIN_FULL;}
      |              ^~
      |              yy0
distcc[20574] ERROR: compile parser.c on localhost failed
gmake: *** [Makefile:576: parser.lo] Error 1
*** Error code 2

Stop.
make[1]: stopped in /usr/pkgsrc/databases/libgda-mysql
*** Error code 1

Stop.
make: stopped in /usr/pkgsrc/databases/libgda-mysql