=> Bootstrap dependency digest>=20211023: found digest-20220214
===> Skipping vulnerability checks.
WARNING: No /usr/pkg/pkgdb/pkg-vulnerabilities file found.
WARNING: To fix run: `/usr/sbin/pkg_admin -K /usr/pkg/pkgdb fetch-pkg-vulnerabilities'.
===> Building for libgda-postgres-5.2.9nb11
gcc -o gen_def -DIMPOSED_HEADER=\""../../../libgda/sql-parser/token_types.h"\" ./gen_def.c
gcc -O2 -I/usr/pkg/include -I/usr/pkg/include/glib-2.0 -I/usr/pkg/include/gio-unix-2.0 -I/usr/pkg/lib/glib-2.0/include -I/usr/include -I/usr/include/readline -I/usr/include/krb5 -I/usr/pkg/include -I/usr/pkg/include/glib-2.0 -I/usr/pkg/include/gio-unix-2.0 -I/usr/pkg/lib/glib-2.0/include -I/usr/include -I/usr/include/readline -I/usr/include/krb5 -Wl,-zrelro -L/usr/pkg/lib -Wl,-R/usr/pkg/lib -L/usr/lib -Wl,-R/usr/lib  ../../../libgda/sql-parser/lemon.c   -o ../../../libgda/sql-parser/lemon
gcc -g -o mkkeywordhash  ../../../libgda/sqlite/mkkeywordhash.c
./mkkeywordhash ../../../providers/reuseable/postgres/keywords_82.list V82 > keywords_hash.c
./mkkeywordhash ../../../providers/reuseable/postgres/keywords_83.list V83 >> keywords_hash.c
./mkkeywordhash ../../../providers/reuseable/postgres/keywords_84.list V84 >> keywords_hash.c
../../../libgda/sql-parser/lemon -q -d -T../../../libgda/sql-parser/lempar.c ./parser.y
../../../libgda/sql-parser/lemon -q -d -T../../../libgda/sql-parser/lempar.c ./parser.y
3 parsing conflicts.
gmake: [Makefile:814: parser.h] Error 1 (ignored)
./gen_def > postgres_token_types.h
  CC       gda-postgres-reuseable.lo
  CC       gda-postgres-parser.lo
3 parsing conflicts.
gmake: [Makefile:814: parser.c] Error 1 (ignored)
  CC       gda-postgres-meta.lo
  CC       parser.lo
distcc[2565] ERROR: compile parser.c on 10.0.20.122:3760 failed
distcc[2565] (dcc_build_somewhere) Warning: remote compilation of 'parser.c' failed, retrying locally
distcc[2565] Warning: failed to distribute parser.c to 10.0.20.122:3760, running locally instead
./parser.y: In function 'yy_destructor':
./parser.y:480:16: error: 'YYMINORTYPE' has no member named 'yy'; did you mean 'yy0'?
  480 | %destructor inscollist_opt {if ($$) {g_slist_foreach ($$, (GFunc) gda_sql_field_free, NULL); g_slist_free ($$);}}
      |                ^~
      |                yy0
./parser.y:480:54: error: 'YYMINORTYPE' has no member named 'yy'; did you mean 'yy0'?
  480 | %destructor inscollist_opt {if ($$) {g_slist_foreach ($$, (GFunc) gda_sql_field_free, NULL); g_slist_free ($$);}}
      |                                                      ^~
      |                                                      yy0
./parser.y:480:123: error: 'YYMINORTYPE' has no member named 'yy'; did you mean 'yy0'?
  480 | %destructor inscollist_opt {if ($$) {g_slist_foreach ($$, (GFunc) gda_sql_field_free, NULL); g_slist_free ($$);}}
      |                                                                                                                           ^ 
      |                                                                                                                           yy0
./parser.y:470:26: error: 'YYMINORTYPE' has no member named 'yy'; did you mean 'yy0'?
  470 |   for (list = $$; list; list = list->next) {
      |                          ^~
      |                          yy0
./parser.y:474:28: error: 'YYMINORTYPE' has no member named 'yy'; did you mean 'yy0'?
  474 |   g_slist_free ($$);
      |                            ^ 
      |                            yy0
./parser.y:523:25: error: 'YYMINORTYPE' has no member named 'yy'; did you mean 'yy0'?
  523 |  for (list = $$; list; list = list->next) {
      |                         ^~
      |                         yy0
./parser.y:529:27: error: 'YYMINORTYPE' has no member named 'yy'; did you mean 'yy0'?
  529 |  g_slist_free ($$);
      |                           ^ 
      |                           yy0
./parser.y:635:38: error: 'YYMINORTYPE' has no member named 'yy'; did you mean 'yy0'?
  635 | %destructor from {gda_sql_select_from_free ($$);}
      |                                      ^~
      |                                      yy0
./parser.y:630:16: error: 'YYMINORTYPE' has no member named 'yy'; did you mean 'yy0'?
  630 | %destructor groupby_opt {if ($$) {g_slist_foreach ($$, (GFunc) gda_sql_expr_free, NULL); g_slist_free ($$);}}
      |                ^~
      |                yy0
./parser.y:630:54: error: 'YYMINORTYPE' has no member named 'yy'; did you mean 'yy0'?
  630 | %destructor groupby_opt {if ($$) {g_slist_foreach ($$, (GFunc) gda_sql_expr_free, NULL); g_slist_free ($$);}}
      |                                                      ^~
      |                                                      yy0
./parser.y:630:122: error: 'YYMINORTYPE' has no member named 'yy'; did you mean 'yy0'?
  630 | %destructor groupby_opt {if ($$) {g_slist_foreach ($$, (GFunc) gda_sql_expr_free, NULL); g_slist_free ($$);}}
      |                                                                                                                          ^ 
      |                                                                                                                          yy0
./parser.y: In function 'yy_reduce':
./parser.y:442:80: error: 'YYMINORTYPE' has no member named 'yy'; did you mean 'yy0'?
  442 |  gda_sql_statement_insert_take_fields_list (C, F);
      |                                                                                ^ 
      |                                                                                yy0
./parser.y:450:80: error: 'YYMINORTYPE' has no member named 'yy'; did you mean 'yy0'?
  450 |  gda_sql_statement_insert_take_fields_list (C, F);
      |                                                                                ^ 
      |                                                                                yy0
./parser.y:452:85: error: 'YYMINORTYPE' has no member named 'yy'; did you mean 'yy0'?
  452 |  gda_sql_statement_insert_take_extra_values_list (C, E);
      |                                                                                     ^ 
      |                                                                                     yy0
./parser.y:459:87: error: 'YYMINORTYPE' has no member named 'yy'; did you mean 'yy0'?
  459 |         gda_sql_statement_insert_take_fields_list (C, F);
      |                                                                                       ^ 
      |                                                                                       yy0
./parser.y:476:14: error: 'YYMINORTYPE' has no member named 'yy'; did you mean 'yy0'?
  476 | ins_extra_values(E) ::= ins_extra_values(A) COMMA LP rexprlist(L) RP. {E = g_slist_append (A, g_slist_reverse (L));}
      |              ^~
      |              yy0
./parser.y:476:55: error: 'YYMINORTYPE' has no member named 'yy'; did you mean 'yy0'?
  476 | ins_extra_values(E) ::= ins_extra_values(A) COMMA LP rexprlist(L) RP. {E = g_slist_append (A, g_slist_reverse (L));}
      |                                                       ^~
      |                                                       yy0
./parser.y:477:14: error: 'YYMINORTYPE' has no member named 'yy'; did you mean 'yy0'?
  477 | ins_extra_values(E) ::= COMMA LP rexprlist(L) RP. {E = g_slist_append (NULL, g_slist_reverse (L));}
      |              ^~
      |              yy0
./parser.y:481:14: error: 'YYMINORTYPE' has no member named 'yy'; did you mean 'yy0'?
  481 | inscollist_opt(A) ::= .                       {A = NULL;}
      |              ^~
      |              yy0
./parser.y:482:14: error: 'YYMINORTYPE' has no member named 'yy'; did you mean 'yy0'?
  482 | inscollist_opt(A) ::= LP inscollist(X) RP.    {A = X;}
      |              ^~
      |              yy0
./parser.y:482:39: error: 'YYMINORTYPE' has no member named 'yy'; did you mean 'yy0'?
  482 | inscollist_opt(A) ::= LP inscollist(X) RP.    {A = X;}
      |                                       ^~
      |                                       yy0
./parser.y:489:23: error: 'YYMINORTYPE' has no member named 'yy'; did you mean 'yy0'?
  489 |           A = g_slist_append (X, field);
      |                       ^~
      |                       yy0
./parser.y:489:64: error: 'YYMINORTYPE' has no member named 'yy'; did you mean 'yy0'?
  489 |           A = g_slist_append (X, field);
      |                                                                ^ 
      |                                                                yy0
./parser.y:493:17: error: 'YYMINORTYPE' has no member named 'yy'; did you mean 'yy0'?
  493 |     A = g_slist_prepend (NULL, field);
      |                 ^~
      |                 yy0
./parser.y:513:30: error: 'YYMINORTYPE' has no member named 'yy'; did you mean 'yy0'?
  513 |  for (list = S; list; list = list->next) {
      |                              ^~
      |                              yy0
./parser.y:518:32: error: 'YYMINORTYPE' has no member named 'yy'; did you mean 'yy0'?
  518 |  g_slist_free (S);
      |                                ^ 
      |                                yy0
./parser.y:535:21: error: 'YYMINORTYPE' has no member named 'yy'; did you mean 'yy0'?
  535 |         A = g_slist_append (Z, set);
      |                     ^~
      |                     yy0
./parser.y:535:62: error: 'YYMINORTYPE' has no member named 'yy'; did you mean 'yy0'?
  535 |         A = g_slist_append (Z, set);
      |                                                              ^ 
      |                                                              yy0
./parser.y:541:18: error: 'YYMINORTYPE' has no member named 'yy'; did you mean 'yy0'?
  541 |      A = g_slist_append (NULL, set);
      |                  ^~
      |                  yy0
./parser.y:583:73: error: 'YYMINORTYPE' has no member named 'yy'; did you mean 'yy0'?
  583 |  gda_sql_statement_select_take_from (C, F);
      |                                                                         ^ 
      |                                                                         yy0
./parser.y:585:77: error: 'YYMINORTYPE' has no member named 'yy'; did you mean 'yy0'?
  585 |  gda_sql_statement_select_take_group_by (C, P);
      |                                                                             ^ 
      |                                                                             yy0
./parser.y:631:14: error: 'YYMINORTYPE' has no member named 'yy'; did you mean 'yy0'?
  631 | groupby_opt(A) ::= .                      {A = 0;}
      |              ^~
      |              yy0
./parser.y:632:14: error: 'YYMINORTYPE' has no member named 'yy'; did you mean 'yy0'?
  632 | groupby_opt(A) ::= GROUP BY rnexprlist(X). {A = g_slist_reverse (X);}
      |              ^~
      |              yy0
./parser.y:636:14: error: 'YYMINORTYPE' has no member named 'yy'; did you mean 'yy0'?
  636 | from(F) ::= .                   {F = NULL;}
      |              ^~
      |              yy0
./parser.y:637:14: error: 'YYMINORTYPE' has no member named 'yy'; did you mean 'yy0'?
  637 | from(F) ::= FROM seltablist(X). {F = X;}
      |              ^~
      |              yy0
./parser.y:637:38: error: 'YYMINORTYPE' has no member named 'yy'; did you mean 'yy0'?
  637 | from(F) ::= FROM seltablist(X). {F = X;}
      |                                      ^~
      |                                      yy0
./parser.y:646:22: error: 'YYMINORTYPE' has no member named 'yy'; did you mean 'yy0'?
  646 |  if (P)
      |                      ^ 
      |                      yy0
./parser.y:647:15: error: 'YYMINORTYPE' has no member named 'yy'; did you mean 'yy0'?
  647 |   L = P;
      |               ^ 
      |               yy0
./parser.y:647:40: error: 'YYMINORTYPE' has no member named 'yy'; did you mean 'yy0'?
  647 |   L = P;
      |                                        ^ 
      |                                        yy0
./parser.y:649:15: error: 'YYMINORTYPE' has no member named 'yy'; did you mean 'yy0'?
  649 |   L = gda_sql_select_from_new (NULL);
      |               ^~
      |               yy0
./parser.y:650:51: error: 'YYMINORTYPE' has no member named 'yy'; did you mean 'yy0'?
  650 |  gda_sql_select_from_take_new_target (L, T);
      |                                                   ^ 
      |                                                   yy0
./parser.y:651:35: error: 'YYMINORTYPE' has no member named 'yy'; did you mean 'yy0'?
  651 |  last = g_slist_last (L->joins);
      |                                   ^ 
      |                                   yy0
./parser.y:651:41: error: invalid type argument of '->' (have 'int')
  651 |  last = g_slist_last (L->joins);
      |                                         ^ 
./parser.y:655:48: error: 'YYMINORTYPE' has no member named 'yy'; did you mean 'yy0'?
  655 |   join->position = g_slist_length (L->targets) - 1;
      |                                                ^~
      |                                                yy0
./parser.y:655:54: error: invalid type argument of '->' (have 'int')
  655 |   join->position = g_slist_length (L->targets) - 1;
      |                                                      ^ 
./parser.y:656:30: error: 'YYMINORTYPE' has no member named 'yy'; did you mean 'yy0'?
  656 |   join->use = U;
      |                              ^ 
      |                              yy0
./parser.y:662:14: error: 'YYMINORTYPE' has no member named 'yy'; did you mean 'yy0'?
  662 | using_opt(U) ::= USING LP inscollist(L) RP. {U = L;}
      |              ^~
      |              yy0
./parser.y:662:39: error: 'YYMINORTYPE' has no member named 'yy'; did you mean 'yy0'?
  662 | using_opt(U) ::= USING LP inscollist(L) RP. {U = L;}
      |                                       ^~
      |                                       yy0
./parser.y:667:24: error: 'YYMINORTYPE' has no member named 'yy'; did you mean 'yy0'?
  667 |            P = L;
      |                        ^ 
      |                        yy0
./parser.y:667:49: error: 'YYMINORTYPE' has no member named 'yy'; did you mean 'yy0'?
  667 |            P = L;
      |                                                 ^ 
      |                                                 yy0
In file included from ../../../libgda/sql-parser/gda-statement-struct.h:26,
                 from ../../../libgda/gda-statement.h:25,
                 from ../../../libgda/sql-parser/gda-sql-parser.h:25,
                 from ../../../libgda/sql-parser/gda-sql-parser-private.h:25,
                 from ./parser.y:41:
./parser.y:668:74: error: 'YYMINORTYPE' has no member named 'yy'; did you mean 'yy0'?
  668 |            join = gda_sql_select_join_new (GDA_SQL_ANY_PART (P));
      |                                                                          ^ 
../../../libgda/sql-parser/gda-statement-struct-decl.h:216:47: note: in definition of macro 'GDA_SQL_ANY_PART'
  216 | #define GDA_SQL_ANY_PART(x) ((GdaSqlAnyPart*)(x))
      |                                               ^
./parser.y:669:40: error: 'YYMINORTYPE' has no member named 'yy'; did you mean 'yy0'?
  669 |            join->type = J;
      |                                        ^ 
      |                                        yy0
./parser.y:670:59: error: 'YYMINORTYPE' has no member named 'yy'; did you mean 'yy0'?
  670 |            gda_sql_select_from_take_new_join (P, join);
      |                                                           ^ 
      |                                                           yy0
./parser.y:680:14: error: 'YYMINORTYPE' has no member named 'yy'; did you mean 'yy0'?
  680 | jointype(J) ::= COMMA. {J = GDA_SQL_SELECT_JOIN_CROSS;}
      |              ^~
      |              yy0
./parser.y:681:14: error: 'YYMINORTYPE' has no member named 'yy'; did you mean 'yy0'?
  681 | jointype(J) ::= JOIN. {J = GDA_SQL_SELECT_JOIN_INNER;}
      |              ^~
      |              yy0
./parser.y:682:14: error: 'YYMINORTYPE' has no member named 'yy'; did you mean 'yy0'?
  682 | jointype(J) ::= CROSS JOIN. {J = GDA_SQL_SELECT_JOIN_CROSS;}
      |              ^~
      |              yy0
./parser.y:683:14: error: 'YYMINORTYPE' has no member named 'yy'; did you mean 'yy0'?
  683 | jointype(J) ::= INNER JOIN. {J = GDA_SQL_SELECT_JOIN_INNER;}
      |              ^~
      |              yy0
./parser.y:684:14: error: 'YYMINORTYPE' has no member named 'yy'; did you mean 'yy0'?
  684 | jointype(J) ::= NATURAL JOIN. {J = GDA_SQL_SELECT_JOIN_NATURAL;}
      |              ^~
      |              yy0
./parser.y:685:14: error: 'YYMINORTYPE' has no member named 'yy'; did you mean 'yy0'?
  685 | jointype(J) ::= LEFT JOIN. {J = GDA_SQL_SELECT_JOIN_LEFT;}
      |              ^~
      |              yy0
./parser.y:686:14: error: 'YYMINORTYPE' has no member named 'yy'; did you mean 'yy0'?
  686 | jointype(J) ::= LEFT OUTER JOIN. {J = GDA_SQL_SELECT_JOIN_LEFT;}
      |              ^~
      |              yy0
./parser.y:687:14: error: 'YYMINORTYPE' has no member named 'yy'; did you mean 'yy0'?
  687 | jointype(J) ::= RIGHT JOIN. {J = GDA_SQL_SELECT_JOIN_RIGHT;}
      |              ^~
      |              yy0
./parser.y:688:14: error: 'YYMINORTYPE' has no member named 'yy'; did you mean 'yy0'?
  688 | jointype(J) ::= RIGHT OUTER JOIN. {J = GDA_SQL_SELECT_JOIN_RIGHT;}
      |              ^~
      |              yy0
./parser.y:689:14: error: 'YYMINORTYPE' has no member named 'yy'; did you mean 'yy0'?
  689 | jointype(J) ::= FULL JOIN. {J = GDA_SQL_SELECT_JOIN_FULL;}
      |              ^~
      |              yy0
./parser.y:690:14: error: 'YYMINORTYPE' has no member named 'yy'; did you mean 'yy0'?
  690 | jointype(J) ::= FULL OUTER JOIN. {J = GDA_SQL_SELECT_JOIN_FULL;}
      |              ^~
      |              yy0
distcc[2565] ERROR: compile parser.c on localhost failed
gmake: *** [Makefile:576: parser.lo] Error 1
gmake: *** Waiting for unfinished jobs....
*** Error code 2

Stop.
make[1]: stopped in /usr/pkgsrc/databases/libgda-postgres
*** Error code 1

Stop.
make: stopped in /usr/pkgsrc/databases/libgda-postgres