=> Bootstrap dependency digest>=20211023: found digest-20220214
===> Skipping vulnerability checks.
WARNING: No /usr/pkg/pkgdb/pkg-vulnerabilities file found.
WARNING: To fix run: `/usr/sbin/pkg_admin -K /usr/pkg/pkgdb fetch-pkg-vulnerabilities'.
===> Building for metakit-lib-2.4.9.7
--- column.lo ---
--- custom.lo ---
--- derived.lo ---
--- column.lo ---
/tmp/pkgbuild/databases/metakit-lib/work.aarch64eb/.cwrapper/bin/libtool  --mode=compile c++ -c -O2  -fPIC -DUSE_TCL_STUBS -I../unix/../include -I../unix/../src -I. ../unix/../src/column.cpp
--- custom.lo ---
/tmp/pkgbuild/databases/metakit-lib/work.aarch64eb/.cwrapper/bin/libtool  --mode=compile c++ -c -O2  -fPIC -DUSE_TCL_STUBS -I../unix/../include -I../unix/../src -I. ../unix/../src/custom.cpp
--- derived.lo ---
/tmp/pkgbuild/databases/metakit-lib/work.aarch64eb/.cwrapper/bin/libtool  --mode=compile c++ -c -O2  -fPIC -DUSE_TCL_STUBS -I../unix/../include -I../unix/../src -I. ../unix/../src/derived.cpp
--- custom.lo ---
libtool: compile:  c++ -c -O2 -fPIC -DUSE_TCL_STUBS -I../unix/../include -I../unix/../src -I. ../unix/../src/custom.cpp  -fPIC -DPIC -o .libs/custom.o
--- column.lo ---
libtool: compile:  c++ -c -O2 -fPIC -DUSE_TCL_STUBS -I../unix/../include -I../unix/../src -I. ../unix/../src/column.cpp  -fPIC -DPIC -o .libs/column.o
--- derived.lo ---
libtool: compile:  c++ -c -O2 -fPIC -DUSE_TCL_STUBS -I../unix/../include -I../unix/../src -I. ../unix/../src/derived.cpp  -fPIC -DPIC -o .libs/derived.o
--- custom.lo ---
distcc[29926] ERROR: compile ../unix/../src/custom.cpp on 10.0.20.122:3760 failed
distcc[29926] (dcc_build_somewhere) Warning: remote compilation of '../unix/../src/custom.cpp' failed, retrying locally
distcc[29926] Warning: failed to distribute ../unix/../src/custom.cpp to 10.0.20.122:3760, running locally instead
--- column.lo ---
distcc[23860] ERROR: compile ../unix/../src/column.cpp on 10.0.20.122:3760 failed
distcc[23860] (dcc_build_somewhere) Warning: remote compilation of '../unix/../src/column.cpp' failed, retrying locally
distcc[23860] Warning: failed to distribute ../unix/../src/column.cpp to 10.0.20.122:3760, running locally instead
--- derived.lo ---
distcc[21582] ERROR: compile ../unix/../src/derived.cpp on 10.0.20.122:3760 failed
distcc[21582] (dcc_build_somewhere) Warning: remote compilation of '../unix/../src/derived.cpp' failed, retrying locally
distcc[21582] Warning: failed to distribute ../unix/../src/derived.cpp to 10.0.20.122:3760, running locally instead
--- custom.lo ---
In file included from ../unix/../src/header.h:191,
                 from ../unix/../src/custom.cpp:9:
../unix/../include/mk4.h:205:14: error: conflicting declaration 'typedef long int t4_i32'
  205 | typedef long t4_i32; // if longs aren't 64b, then they are 32b
      |              ^~~~~~
In file included from ../unix/../src/custom.cpp:9:
../unix/../src/header.h:143:13: note: previous declaration as 'typedef int t4_i32'
  143 | typedef int t4_i32; // longs are 64b, so int must be 32b
      |             ^~~~~~
--- column.lo ---
In file included from ../unix/../src/header.h:191,
                 from ../unix/../src/column.cpp:9:
../unix/../include/mk4.h:205:14: error: conflicting declaration 'typedef long int t4_i32'
  205 | typedef long t4_i32; // if longs aren't 64b, then they are 32b
      |              ^~~~~~
In file included from ../unix/../src/column.cpp:9:
../unix/../src/header.h:143:13: note: previous declaration as 'typedef int t4_i32'
  143 | typedef int t4_i32; // longs are 64b, so int must be 32b
      |             ^~~~~~
--- derived.lo ---
In file included from ../unix/../src/header.h:191,
                 from ../unix/../src/derived.cpp:9:
../unix/../include/mk4.h:205:14: error: conflicting declaration 'typedef long int t4_i32'
  205 | typedef long t4_i32; // if longs aren't 64b, then they are 32b
      |              ^~~~~~
In file included from ../unix/../src/derived.cpp:9:
../unix/../src/header.h:143:13: note: previous declaration as 'typedef int t4_i32'
  143 | typedef int t4_i32; // longs are 64b, so int must be 32b
      |             ^~~~~~
--- custom.lo ---
distcc[29926] ERROR: compile ../unix/../src/custom.cpp on localhost failed
*** [custom.lo] Error code 1

make: stopped in /tmp/pkgbuild/databases/metakit-lib/work.aarch64eb/metakit-2.4.9.7/builds
--- column.lo ---
distcc[23860] ERROR: compile ../unix/../src/column.cpp on localhost failed
*** [column.lo] Error code 1

make: stopped in /tmp/pkgbuild/databases/metakit-lib/work.aarch64eb/metakit-2.4.9.7/builds
--- derived.lo ---
distcc[21582] ERROR: compile ../unix/../src/derived.cpp on localhost failed
*** [derived.lo] Error code 1

make: stopped in /tmp/pkgbuild/databases/metakit-lib/work.aarch64eb/metakit-2.4.9.7/builds
3 errors

make: stopped in /tmp/pkgbuild/databases/metakit-lib/work.aarch64eb/metakit-2.4.9.7/builds
*** Error code 2

Stop.
make[1]: stopped in /usr/pkgsrc/databases/metakit-lib
*** Error code 1

Stop.
make: stopped in /usr/pkgsrc/databases/metakit-lib