=> Bootstrap dependency digest>=20211023: found digest-20220214
===> Skipping vulnerability checks.
WARNING: No /usr/pkg/pkgdb/pkg-vulnerabilities file found.
WARNING: To fix run: `/usr/sbin/pkg_admin -K /usr/pkg/pkgdb fetch-pkg-vulnerabilities'.
===> Building for minimap2-2.24nb1
gcc -c -O2 -I/usr/include -Wall -Wc++-compat  -DHAVE_KALLOC  main.c -o main.o
gcc -c -O2 -I/usr/include -Wall -Wc++-compat  -DHAVE_KALLOC  kthread.c -o kthread.o
gcc -c -O2 -I/usr/include -Wall -Wc++-compat  -DHAVE_KALLOC  kalloc.c -o kalloc.o
gcc -c -O2 -I/usr/include -Wall -Wc++-compat  -DHAVE_KALLOC  misc.c -o misc.o
gcc -c -O2 -I/usr/include -Wall -Wc++-compat  -DHAVE_KALLOC  bseq.c -o bseq.o
gcc -c -O2 -I/usr/include -Wall -Wc++-compat  -DHAVE_KALLOC  sketch.c -o sketch.o
gcc -c -O2 -I/usr/include -Wall -Wc++-compat  -DHAVE_KALLOC  sdust.c -o sdust.o
gcc -c -O2 -I/usr/include -Wall -Wc++-compat  -DHAVE_KALLOC  options.c -o options.o
gcc -c -O2 -I/usr/include -Wall -Wc++-compat  -DHAVE_KALLOC  index.c -o index.o
gcc -c -O2 -I/usr/include -Wall -Wc++-compat  -DHAVE_KALLOC  lchain.c -o lchain.o
gcc -c -O2 -I/usr/include -Wall -Wc++-compat  -DHAVE_KALLOC  align.c -o align.o
gcc -c -O2 -I/usr/include -Wall -Wc++-compat  -DHAVE_KALLOC  hit.c -o hit.o
index.c: In function 'mm_idx_alt_read':
index.c:648:25: warning: array subscript has type 'char' [-Wchar-subscripts]
index.c: In function 'mm_idx_read_bed':
index.c:696:10: warning: array subscript has type 'char' [-Wchar-subscripts]
gcc -c -O2 -I/usr/include -Wall -Wc++-compat  -DHAVE_KALLOC  seed.c -o seed.o
gcc -c -O2 -I/usr/include -Wall -Wc++-compat  -DHAVE_KALLOC  map.c -o map.o
gcc -c -O2 -I/usr/include -Wall -Wc++-compat  -DHAVE_KALLOC  format.c -o format.o
gcc -c -O2 -I/usr/include -Wall -Wc++-compat  -DHAVE_KALLOC  pe.c -o pe.o
gcc -c -O2 -I/usr/include -Wall -Wc++-compat  -DHAVE_KALLOC  esterr.c -o esterr.o
gcc -c -O2 -I/usr/include -Wall -Wc++-compat  -DHAVE_KALLOC  splitidx.c -o splitidx.o
gcc -c -O2 -I/usr/include -Wall -Wc++-compat  -msse2 -DHAVE_KALLOC  ksw2_ll_sse.c -o ksw2_ll_sse.o
gcc -c -O2 -I/usr/include -Wall -Wc++-compat  -msse4.1 -DHAVE_KALLOC -DKSW_CPU_DISPATCH  ksw2_extz2_sse.c -o ksw2_extz2_sse41.o
gcc: error: unrecognized command-line option '-msse4.1'
distcc[3889] ERROR: compile ksw2_extz2_sse.c on 10.0.20.122:3760 failed
distcc[3889] (dcc_build_somewhere) Warning: remote compilation of 'ksw2_extz2_sse.c' failed, retrying locally
distcc[3889] Warning: failed to distribute ksw2_extz2_sse.c to 10.0.20.122:3760, running locally instead
gcc: error: unrecognized command-line option '-msse2'
distcc[13235] ERROR: compile ksw2_ll_sse.c on 10.0.20.122:3760 failed
distcc[13235] (dcc_build_somewhere) Warning: remote compilation of 'ksw2_ll_sse.c' failed, retrying locally
distcc[13235] Warning: failed to distribute ksw2_ll_sse.c to 10.0.20.122:3760, running locally instead
gcc: error: unrecognized command-line option '-msse4.1'
distcc[3889] ERROR: compile ksw2_extz2_sse.c on localhost failed
gmake: *** [Makefile:67: ksw2_extz2_sse41.o] Error 1
gmake: *** Waiting for unfinished jobs....
gcc: error: unrecognized command-line option '-msse2'
distcc[13235] ERROR: compile ksw2_ll_sse.c on localhost failed
gmake: *** [Makefile:63: ksw2_ll_sse.o] Error 1
*** Error code 2

Stop.
make[1]: stopped in /usr/pkgsrc/biology/minimap2
*** Error code 1

Stop.
make: stopped in /usr/pkgsrc/biology/minimap2