=> Bootstrap dependency digest>=20211023: found digest-20220214
===> Skipping vulnerability checks.
WARNING: No /usr/pkg/pkgdb/pkg-vulnerabilities file found.
WARNING: To fix run: `/usr/sbin/pkg_admin -K /usr/pkg/pkgdb fetch-pkg-vulnerabilities'.
===> Building for openmp-16.0.6
[  5%] Generating kmp_i18n_id.inc
[  5%] Generating kmp_i18n_default.inc
[  5%] Built target libomp-needed-headers
[ 11%] Building CXX object runtime/src/CMakeFiles/omp.dir/kmp_alloc.cpp.o
[ 11%] Building CXX object runtime/src/CMakeFiles/omp.dir/kmp_csupport.cpp.o
[ 14%] Building CXX object runtime/src/CMakeFiles/omp.dir/kmp_atomic.cpp.o
[ 17%] Building CXX object runtime/src/CMakeFiles/omp.dir/kmp_debug.cpp.o
[ 20%] Building CXX object runtime/src/CMakeFiles/omp.dir/kmp_itt.cpp.o
[ 22%] Building CXX object runtime/src/CMakeFiles/omp.dir/kmp_environment.cpp.o
[ 25%] Building CXX object runtime/src/CMakeFiles/omp.dir/kmp_error.cpp.o
[ 28%] Building CXX object runtime/src/CMakeFiles/omp.dir/kmp_global.cpp.o
[ 31%] Building CXX object runtime/src/CMakeFiles/omp.dir/kmp_i18n.cpp.o
[ 34%] Building CXX object runtime/src/CMakeFiles/omp.dir/kmp_io.cpp.o
[ 37%] Building CXX object runtime/src/CMakeFiles/omp.dir/kmp_runtime.cpp.o
[ 40%] Building CXX object runtime/src/CMakeFiles/omp.dir/kmp_settings.cpp.o
[ 42%] Building CXX object runtime/src/CMakeFiles/omp.dir/kmp_str.cpp.o
distcc[13164] ERROR: compile /tmp/pkgbuild/parallel/openmp/work.aarch64eb/openmp-16.0.6.src/runtime/src/kmp_runtime.cpp on 10.0.20.122:3760 failed
distcc[13164] (dcc_build_somewhere) Warning: remote compilation of '/tmp/pkgbuild/parallel/openmp/work.aarch64eb/openmp-16.0.6.src/runtime/src/kmp_runtime.cpp' failed, retrying locally
distcc[13164] Warning: failed to distribute /tmp/pkgbuild/parallel/openmp/work.aarch64eb/openmp-16.0.6.src/runtime/src/kmp_runtime.cpp to 10.0.20.122:3760, running locally instead
/tmp/pkgbuild/parallel/openmp/work.aarch64eb/openmp-16.0.6.src/runtime/src/kmp_runtime.cpp: In function 'bool __kmp_is_fork_in_teams(kmp_info_t*, microtask_t, int, int, kmp_va_list)':
/tmp/pkgbuild/parallel/openmp/work.aarch64eb/openmp-16.0.6.src/runtime/src/kmp_runtime.cpp:1363:47: error: invalid operands of types 'kmp_va_list' {aka 'va_list'} and 'int' to binary 'operator!='
 1363 |   return (master_th->th.th_teams_microtask && ap &&
      |                                               ^~
/tmp/pkgbuild/parallel/openmp/work.aarch64eb/openmp-16.0.6.src/runtime/src/kmp_runtime.cpp:1363:47: error: invalid operands of types 'kmp_va_list' {aka 'va_list'} and 'int' to binary 'operator!='
/tmp/pkgbuild/parallel/openmp/work.aarch64eb/openmp-16.0.6.src/runtime/src/kmp_runtime.cpp: In function 'bool __kmp_is_entering_teams(int, int, int, kmp_va_list)':
/tmp/pkgbuild/parallel/openmp/work.aarch64eb/openmp-16.0.6.src/runtime/src/kmp_runtime.cpp:1371:15: error: invalid operands of types 'kmp_va_list' {aka 'va_list'} and 'long int' to binary 'operator=='
 1371 |   return ((ap == NULL && active_level == 0) ||
      |               ^
/tmp/pkgbuild/parallel/openmp/work.aarch64eb/openmp-16.0.6.src/runtime/src/kmp_runtime.cpp:1372:12: error: invalid operands of types 'kmp_va_list' {aka 'va_list'} and 'int' to binary 'operator!='
 1372 |           (ap && teams_level > 0 && teams_level == level));
      |            ^~
/tmp/pkgbuild/parallel/openmp/work.aarch64eb/openmp-16.0.6.src/runtime/src/kmp_runtime.cpp:1372:32: error: invalid operands of types 'kmp_va_list' {aka 'va_list'} and 'int' to binary 'operator!='
 1372 |           (ap && teams_level > 0 && teams_level == level));
      |                                ^
[ 45%] Building CXX object runtime/src/CMakeFiles/omp.dir/kmp_tasking.cpp.o
/tmp/pkgbuild/parallel/openmp/work.aarch64eb/openmp-16.0.6.src/runtime/src/kmp_runtime.cpp: In function 'int __kmp_serial_fork_call(ident_t*, int, fork_context_e, kmp_int32, microtask_t, launch_t, kmp_info_t*, kmp_team_t*, ompt_data_t*, void**, ompt_data_t**, kmp_va_list)':
/tmp/pkgbuild/parallel/openmp/work.aarch64eb/openmp-16.0.6.src/runtime/src/kmp_runtime.cpp:1649:10: error: could not convert 'ap' from 'kmp_va_list' {aka 'va_list'} to 'bool'
 1649 |     if (!ap) {
      |          ^~
      |          |
      |          kmp_va_list {aka va_list}
/tmp/pkgbuild/parallel/openmp/work.aarch64eb/openmp-16.0.6.src/runtime/src/kmp_runtime.cpp:1649:10: error: in argument to unary !
/tmp/pkgbuild/parallel/openmp/work.aarch64eb/openmp-16.0.6.src/runtime/src/kmp_runtime.cpp:1720:11: error: could not convert 'ap' from 'kmp_va_list' {aka 'va_list'} to 'bool'
 1720 |       if (ap) {
      |           ^~
      |           |
      |           kmp_va_list {aka va_list}
/tmp/pkgbuild/parallel/openmp/work.aarch64eb/openmp-16.0.6.src/runtime/src/kmp_runtime.cpp: In function 'int __kmp_fork_call(ident_t*, int, fork_context_e, kmp_int32, microtask_t, launch_t, kmp_va_list)':
/tmp/pkgbuild/parallel/openmp/work.aarch64eb/openmp-16.0.6.src/runtime/src/kmp_runtime.cpp:2077:66: error: invalid operands of types 'kmp_va_list' {aka 'va_list'} and 'long int' to binary 'operator=='
 2077 |             !(microtask == (microtask_t)__kmp_teams_master || ap == NULL))
      |                                                                  ^
/tmp/pkgbuild/parallel/openmp/work.aarch64eb/openmp-16.0.6.src/runtime/src/kmp_runtime.cpp:2232:9: error: could not convert 'ap' from 'kmp_va_list' {aka 'va_list'} to 'bool'
 2232 |     if (ap) {
      |         ^~
      |         |
      |         kmp_va_list {aka va_list}
/tmp/pkgbuild/parallel/openmp/work.aarch64eb/openmp-16.0.6.src/runtime/src/kmp_runtime.cpp:2250:59: error: could not convert 'ap' from 'kmp_va_list' {aka 'va_list'} to 'bool'
 2250 |     __kmp_fork_team_threads(root, team, master_th, gtid, !ap);
      |                                                           ^~
      |                                                           |
      |                                                           kmp_va_list {aka va_list}
/tmp/pkgbuild/parallel/openmp/work.aarch64eb/openmp-16.0.6.src/runtime/src/kmp_runtime.cpp:2250:59: error: in argument to unary !
/tmp/pkgbuild/parallel/openmp/work.aarch64eb/openmp-16.0.6.src/runtime/src/kmp_runtime.cpp:2311:9: error: could not convert 'ap' from 'kmp_va_list' {aka 'va_list'} to 'bool'
 2311 |     if (ap) {
      |         ^~
      |         |
      |         kmp_va_list {aka va_list}
In file included from /usr/include/stddef.h:56,
                 from /tmp/pkgbuild/parallel/openmp/work.aarch64eb/openmp-16.0.6.src/runtime/src/kmp.h:65,
                 from /tmp/pkgbuild/parallel/openmp/work.aarch64eb/openmp-16.0.6.src/runtime/src/kmp_runtime.cpp:13:
/tmp/pkgbuild/parallel/openmp/work.aarch64eb/openmp-16.0.6.src/runtime/src/kmp_runtime.cpp: In function 'void __kmp_teams_master(int)':
/tmp/pkgbuild/parallel/openmp/work.aarch64eb/openmp-16.0.6.src/runtime/src/kmp_runtime.cpp:7738:67: error: cannot convert 'long int' to 'kmp_va_list' {aka 'va_list'}
 7738 |                   VOLATILE_CAST(launch_t) __kmp_invoke_task_func, NULL);
      |                                                                   ^~~~
      |                                                                   |
      |                                                                   long int
/tmp/pkgbuild/parallel/openmp/work.aarch64eb/openmp-16.0.6.src/runtime/src/kmp_runtime.cpp:1850:33: note:   initializing argument 7 of 'int __kmp_fork_call(ident_t*, int, fork_context_e, kmp_int32, microtask_t, launch_t, kmp_va_list)'
 1850 |                     kmp_va_list ap) {
      |                     ~~~~~~~~~~~~^~
/tmp/pkgbuild/parallel/openmp/work.aarch64eb/openmp-16.0.6.src/runtime/src/kmp_runtime.cpp: At global scope:
/tmp/pkgbuild/parallel/openmp/work.aarch64eb/openmp-16.0.6.src/runtime/src/kmp_runtime.cpp:916:13: warning: 'void __kmp_fork_team_threads(kmp_root_t*, kmp_team_t*, kmp_info_t*, int, int)' defined but not used [-Wunused-function]
  916 | static void __kmp_fork_team_threads(kmp_root_t *root, kmp_team_t *team,
      |             ^~~~~~~~~~~~~~~~~~~~~~~
distcc[13164] ERROR: compile /tmp/pkgbuild/parallel/openmp/work.aarch64eb/openmp-16.0.6.src/runtime/src/kmp_runtime.cpp on localhost failed
--- runtime/src/CMakeFiles/omp.dir/kmp_runtime.cpp.o ---
*** [runtime/src/CMakeFiles/omp.dir/kmp_runtime.cpp.o] Error code 1

make[2]: stopped in /tmp/pkgbuild/parallel/openmp/work.aarch64eb/openmp-16.0.6.src/cmake-pkgsrc-build
/tmp/pkgbuild/parallel/openmp/work.aarch64eb/openmp-16.0.6.src/runtime/src/kmp_tasking.cpp: In function 'void __kmp_wait_to_unref_task_teams()':
/tmp/pkgbuild/parallel/openmp/work.aarch64eb/openmp-16.0.6.src/runtime/src/kmp_tasking.cpp:3879:14: warning: variable 'time' set but not used [-Wunused-but-set-variable]
In file included from /tmp/pkgbuild/parallel/openmp/work.aarch64eb/openmp-16.0.6.src/runtime/src/kmp_tasking.cpp:17:
/tmp/pkgbuild/parallel/openmp/work.aarch64eb/openmp-16.0.6.src/runtime/src/kmp_wait_release.h: In instantiation of 'bool __kmp_wait_template(kmp_info_t*, C*, void*) [with C = kmp_flag_oncore; bool final_spin = true; bool Cancellable = false; bool Sleepable = true; kmp_info_t = kmp_info]':
/tmp/pkgbuild/parallel/openmp/work.aarch64eb/openmp-16.0.6.src/runtime/src/kmp_wait_release.h:990:40:   required from here
/tmp/pkgbuild/parallel/openmp/work.aarch64eb/openmp-16.0.6.src/runtime/src/kmp_wait_release.h:380:14: warning: variable 'time' set but not used [-Wunused-but-set-variable]
/tmp/pkgbuild/parallel/openmp/work.aarch64eb/openmp-16.0.6.src/runtime/src/kmp_wait_release.h: In instantiation of 'bool __kmp_wait_template(kmp_info_t*, C*, void*) [with C = kmp_flag_oncore; bool final_spin = false; bool Cancellable = false; bool Sleepable = true; kmp_info_t = kmp_info]':
/tmp/pkgbuild/parallel/openmp/work.aarch64eb/openmp-16.0.6.src/runtime/src/kmp_wait_release.h:993:40:   required from here
/tmp/pkgbuild/parallel/openmp/work.aarch64eb/openmp-16.0.6.src/runtime/src/kmp_wait_release.h:380:14: warning: variable 'time' set but not used [-Wunused-but-set-variable]
/tmp/pkgbuild/parallel/openmp/work.aarch64eb/openmp-16.0.6.src/runtime/src/kmp_wait_release.h: In instantiation of 'bool __kmp_wait_template(kmp_info_t*, C*, void*) [with C = kmp_flag_32<false, false>; bool final_spin = true; bool Cancellable = false; bool Sleepable = false; kmp_info_t = kmp_info]':
/tmp/pkgbuild/parallel/openmp/work.aarch64eb/openmp-16.0.6.src/runtime/src/kmp_wait_release.h:845:76:   required from 'bool kmp_flag_32<C, S>::wait(kmp_info_t*, int, void*) [with bool Cancellable = false; bool Sleepable = false; kmp_info_t = kmp_info]'
/tmp/pkgbuild/parallel/openmp/work.aarch64eb/openmp-16.0.6.src/runtime/src/kmp_tasking.cpp:4065:46:   required from here
/tmp/pkgbuild/parallel/openmp/work.aarch64eb/openmp-16.0.6.src/runtime/src/kmp_wait_release.h:380:14: warning: variable 'time' set but not used [-Wunused-but-set-variable]
/tmp/pkgbuild/parallel/openmp/work.aarch64eb/openmp-16.0.6.src/runtime/src/kmp_wait_release.h: In instantiation of 'bool __kmp_wait_template(kmp_info_t*, C*, void*) [with C = kmp_flag_32<false, false>; bool final_spin = false; bool Cancellable = false; bool Sleepable = false; kmp_info_t = kmp_info]':
/tmp/pkgbuild/parallel/openmp/work.aarch64eb/openmp-16.0.6.src/runtime/src/kmp_wait_release.h:848:73:   required from 'bool kmp_flag_32<C, S>::wait(kmp_info_t*, int, void*) [with bool Cancellable = false; bool Sleepable = false; kmp_info_t = kmp_info]'
/tmp/pkgbuild/parallel/openmp/work.aarch64eb/openmp-16.0.6.src/runtime/src/kmp_tasking.cpp:4065:46:   required from here
/tmp/pkgbuild/parallel/openmp/work.aarch64eb/openmp-16.0.6.src/runtime/src/kmp_wait_release.h:380:14: warning: variable 'time' set but not used [-Wunused-but-set-variable]
1 error

make[2]: stopped in /tmp/pkgbuild/parallel/openmp/work.aarch64eb/openmp-16.0.6.src/cmake-pkgsrc-build
--- runtime/src/CMakeFiles/omp.dir/all ---
*** [runtime/src/CMakeFiles/omp.dir/all] Error code 2

make[1]: stopped in /tmp/pkgbuild/parallel/openmp/work.aarch64eb/openmp-16.0.6.src/cmake-pkgsrc-build
1 error

make[1]: stopped in /tmp/pkgbuild/parallel/openmp/work.aarch64eb/openmp-16.0.6.src/cmake-pkgsrc-build
*** [all] Error code 2

make: stopped in /tmp/pkgbuild/parallel/openmp/work.aarch64eb/openmp-16.0.6.src/cmake-pkgsrc-build
1 error

make: stopped in /tmp/pkgbuild/parallel/openmp/work.aarch64eb/openmp-16.0.6.src/cmake-pkgsrc-build
*** Error code 2

Stop.
make[1]: stopped in /usr/pkgsrc/parallel/openmp
*** Error code 1

Stop.
make: stopped in /usr/pkgsrc/parallel/openmp