=> Bootstrap dependency digest>=20211023: found digest-20220214
===> Skipping vulnerability checks.
WARNING: No /usr/pkg/pkgdb/pkg-vulnerabilities file found.
WARNING: To fix run: `/usr/sbin/pkg_admin -K /usr/pkg/pkgdb fetch-pkg-vulnerabilities'.
===> Building for racon-1.4.3
[  3%] Building C object vendor/bioparser/vendor/zlib/CMakeFiles/zlibstatic.dir/adler32.o
[  6%] Building CXX object vendor/thread_pool/CMakeFiles/thread_pool.dir/src/thread_pool.cpp.o
[  9%] Building CXX object vendor/spoa/CMakeFiles/spoa.dir/src/alignment_engine.cpp.o
[ 12%] Building C object vendor/bioparser/vendor/zlib/CMakeFiles/zlibstatic.dir/compress.o
[ 15%] Building C object vendor/bioparser/vendor/zlib/CMakeFiles/zlibstatic.dir/crc32.o
[ 18%] Building C object vendor/bioparser/vendor/zlib/CMakeFiles/zlibstatic.dir/deflate.o
[ 21%] Building CXX object vendor/spoa/CMakeFiles/spoa.dir/src/graph.cpp.o
[ 24%] Building C object vendor/bioparser/vendor/zlib/CMakeFiles/zlibstatic.dir/gzclose.o
[ 27%] Building C object vendor/bioparser/vendor/zlib/CMakeFiles/zlibstatic.dir/gzlib.o
[ 30%] Building C object vendor/bioparser/vendor/zlib/CMakeFiles/zlibstatic.dir/gzread.o
[ 33%] Building C object vendor/bioparser/vendor/zlib/CMakeFiles/zlibstatic.dir/gzwrite.o
[ 36%] Building C object vendor/bioparser/vendor/zlib/CMakeFiles/zlibstatic.dir/inflate.o
[ 39%] Building C object vendor/bioparser/vendor/zlib/CMakeFiles/zlibstatic.dir/infback.o
[ 42%] Building C object vendor/bioparser/vendor/zlib/CMakeFiles/zlibstatic.dir/inftrees.o
[ 45%] Building C object vendor/bioparser/vendor/zlib/CMakeFiles/zlibstatic.dir/inffast.o
[ 48%] Linking CXX static library lib/libthread_pool.a
[ 48%] Built target thread_pool
[ 51%] Building CXX object vendor/edlib/CMakeFiles/edlib_static.dir/edlib/src/edlib.cpp.o
[ 54%] Building C object vendor/bioparser/vendor/zlib/CMakeFiles/zlibstatic.dir/trees.o
[ 57%] Building C object vendor/bioparser/vendor/zlib/CMakeFiles/zlibstatic.dir/uncompr.o
[ 60%] Building C object vendor/bioparser/vendor/zlib/CMakeFiles/zlibstatic.dir/zutil.o
[ 63%] Linking C static library ../../lib/libz.a
[ 63%] Built target zlibstatic
[ 66%] Building CXX object vendor/logger/CMakeFiles/logger.dir/src/logger.cpp.o
[ 69%] Linking CXX static library ../../lib/libedlib_static.a
[ 69%] Built target edlib_static
[ 72%] Building CXX object vendor/spoa/CMakeFiles/spoa.dir/src/simd_alignment_engine.cpp.o
/tmp/pkgbuild/biology/racon/work.aarch64eb/racon-v1.4.3/vendor/spoa/src/simd_alignment_engine.cpp:11:14: fatal error: immintrin.h: No such file or directory
   11 |     #include <immintrin.h> // AVX2 and lower
      |              ^~~~~~~~~~~~~
compilation terminated.
distcc[12805] ERROR: compile (null) on localhost failed
--- vendor/spoa/CMakeFiles/spoa.dir/src/simd_alignment_engine.cpp.o ---
*** [vendor/spoa/CMakeFiles/spoa.dir/src/simd_alignment_engine.cpp.o] Error code 1

make[2]: stopped in /tmp/pkgbuild/biology/racon/work.aarch64eb/racon-v1.4.3
--- vendor/logger/CMakeFiles/logger.dir/all ---
*** [vendor/logger/CMakeFiles/logger.dir/all] Error code 6

make[1]: stopped in /tmp/pkgbuild/biology/racon/work.aarch64eb/racon-v1.4.3
1 error

make[2]: stopped in /tmp/pkgbuild/biology/racon/work.aarch64eb/racon-v1.4.3
--- vendor/spoa/CMakeFiles/spoa.dir/all ---
*** [vendor/spoa/CMakeFiles/spoa.dir/all] Error code 2

make[1]: stopped in /tmp/pkgbuild/biology/racon/work.aarch64eb/racon-v1.4.3
2 errors

make[1]: stopped in /tmp/pkgbuild/biology/racon/work.aarch64eb/racon-v1.4.3
*** [all] Error code 2

make: stopped in /tmp/pkgbuild/biology/racon/work.aarch64eb/racon-v1.4.3
1 error

make: stopped in /tmp/pkgbuild/biology/racon/work.aarch64eb/racon-v1.4.3
*** Error code 2

Stop.
make[1]: stopped in /usr/pkgsrc/biology/racon
*** Error code 1

Stop.
make: stopped in /usr/pkgsrc/biology/racon