=> Bootstrap dependency digest>=20211023: found digest-20220214
===> Skipping vulnerability checks.
WARNING: No /usr/pkg/pkgdb/pkg-vulnerabilities file found.
WARNING: To fix run: `/usr/sbin/pkg_admin -K /usr/pkg/pkgdb fetch-pkg-vulnerabilities'.
===> Building for sdlpop-1.22nb6
gcc -I/usr/pkg/include -I/usr/pkg/include/SDL2 -I/usr/X11R7/include -I/usr/X11R7/include/libdrm -I/usr/include -Wall -D_GNU_SOURCE=1 -O2 -DPKGSRC_DATA_PATH="\"/usr/pkg/share/sdlpop/\"" -I/usr/pkg/include -I/usr/pkg/include/SDL2 -I/usr/X11R7/include -I/usr/X11R7/include/libdrm -I/usr/include -std=gnu99 -O2 -I/usr/pkg/include/SDL2 -I/usr/pkg/include -I/usr/X11R7/include -D_REENTRANT -D_THREAD_SAFE -Wl,-zrelro -L/usr/pkg/lib -Wl,-R/usr/pkg/lib -L/usr/X11R7/lib -Wl,-R/usr/X11R7/lib -L/usr/lib -Wl,-R/usr/lib -c main.c
gcc -I/usr/pkg/include -I/usr/pkg/include/SDL2 -I/usr/X11R7/include -I/usr/X11R7/include/libdrm -I/usr/include -Wall -D_GNU_SOURCE=1 -O2 -DPKGSRC_DATA_PATH="\"/usr/pkg/share/sdlpop/\"" -I/usr/pkg/include -I/usr/pkg/include/SDL2 -I/usr/X11R7/include -I/usr/X11R7/include/libdrm -I/usr/include -std=gnu99 -O2 -I/usr/pkg/include/SDL2 -I/usr/pkg/include -I/usr/X11R7/include -D_REENTRANT -D_THREAD_SAFE -Wl,-zrelro -L/usr/pkg/lib -Wl,-R/usr/pkg/lib -L/usr/X11R7/lib -Wl,-R/usr/X11R7/lib -L/usr/lib -Wl,-R/usr/lib -c data.c
gcc -I/usr/pkg/include -I/usr/pkg/include/SDL2 -I/usr/X11R7/include -I/usr/X11R7/include/libdrm -I/usr/include -Wall -D_GNU_SOURCE=1 -O2 -DPKGSRC_DATA_PATH="\"/usr/pkg/share/sdlpop/\"" -I/usr/pkg/include -I/usr/pkg/include/SDL2 -I/usr/X11R7/include -I/usr/X11R7/include/libdrm -I/usr/include -std=gnu99 -O2 -I/usr/pkg/include/SDL2 -I/usr/pkg/include -I/usr/X11R7/include -D_REENTRANT -D_THREAD_SAFE -Wl,-zrelro -L/usr/pkg/lib -Wl,-R/usr/pkg/lib -L/usr/X11R7/lib -Wl,-R/usr/X11R7/lib -L/usr/lib -Wl,-R/usr/lib -c seg000.c
In file included from common.h:54,
                 from main.c:21:
types.h:39:2: error: #error This program is not (yet) prepared for big endian CPUs, please contact the author.
   39 | #error This program is not (yet) prepared for big endian CPUs, please contact the author.
      |  ^~~~~
distcc[22525] ERROR: compile main.c on 10.0.20.122:3760 failed
distcc[22525] (dcc_build_somewhere) Warning: remote compilation of 'main.c' failed, retrying locally
distcc[22525] Warning: failed to distribute main.c to 10.0.20.122:3760, running locally instead
In file included from common.h:54,
                 from data.c:21:
types.h:39:2: error: #error This program is not (yet) prepared for big endian CPUs, please contact the author.
   39 | #error This program is not (yet) prepared for big endian CPUs, please contact the author.
      |  ^~~~~
distcc[8522] ERROR: compile data.c on 10.0.20.122:3760 failed
distcc[8522] (dcc_build_somewhere) Warning: remote compilation of 'data.c' failed, retrying locally
distcc[8522] Warning: failed to distribute data.c to 10.0.20.122:3760, running locally instead
In file included from common.h:54,
                 from seg000.c:21:
types.h:39:2: error: #error This program is not (yet) prepared for big endian CPUs, please contact the author.
   39 | #error This program is not (yet) prepared for big endian CPUs, please contact the author.
      |  ^~~~~
distcc[15127] ERROR: compile seg000.c on 10.0.20.122:3760 failed
distcc[15127] (dcc_build_somewhere) Warning: remote compilation of 'seg000.c' failed, retrying locally
distcc[15127] Warning: failed to distribute seg000.c to 10.0.20.122:3760, running locally instead
In file included from common.h:54,
                 from data.c:21:
types.h:39:2: error: #error This program is not (yet) prepared for big endian CPUs, please contact the author.
   39 | #error This program is not (yet) prepared for big endian CPUs, please contact the author.
      |  ^~~~~
In file included from common.h:54,
                 from main.c:21:
types.h:39:2: error: #error This program is not (yet) prepared for big endian CPUs, please contact the author.
   39 | #error This program is not (yet) prepared for big endian CPUs, please contact the author.
      |  ^~~~~
distcc[22525] ERROR: compile main.c on localhost failed
gmake: *** [Makefile:39: main.o] Error 1
gmake: *** Waiting for unfinished jobs....
distcc[8522] ERROR: compile data.c on localhost failed
gmake: *** [Makefile:39: data.o] Error 1
In file included from common.h:54,
                 from seg000.c:21:
types.h:39:2: error: #error This program is not (yet) prepared for big endian CPUs, please contact the author.
   39 | #error This program is not (yet) prepared for big endian CPUs, please contact the author.
      |  ^~~~~
distcc[15127] ERROR: compile seg000.c on localhost failed
gmake: *** [Makefile:39: seg000.o] Error 1
*** Error code 2

Stop.
make[1]: stopped in /usr/pkgsrc/games/sdlpop
*** Error code 1

Stop.
make: stopped in /usr/pkgsrc/games/sdlpop