=> Bootstrap dependency digest>=20211023: found digest-20220214
===> Skipping vulnerability checks.
WARNING: No /usr/pkg/pkgdb/pkg-vulnerabilities file found.
WARNING: To fix run: `/usr/sbin/pkg_admin -K /usr/pkg/pkgdb fetch-pkg-vulnerabilities'.
===> Building for spidermonkey185-1.8.5nb8
/usr/pkg/bin/gmake export
gmake[1]: Entering directory '/tmp/pkgbuild/lang/spidermonkey185/work.aarch64eb/js-1.8.5/js/src'
/usr/pkg/bin/gmake -C config/ nsinstall
gmake[2]: Entering directory '/tmp/pkgbuild/lang/spidermonkey185/work.aarch64eb/js-1.8.5/js/src/config'
nsinstall.c
exec sh ../build/unix/print-failed-commands.sh  gcc -o host_nsinstall.o -c -I/usr/include -I/usr/pkg/include -I/usr/pkg/include/nspr -Wall -W -Wno-unused -Wpointer-arith -Wcast-align -W -pedantic -Wno-long-long -O2 -I/usr/include -I/usr/pkg/include -I/usr/pkg/include/nspr -fno-strict-aliasing -Dunix -pthread -pipe -DNDEBUG -DTRIMMED -O3 -DXP_UNIX -O3  -DUNICODE -D_UNICODE  -I. -I. -I../dist/include -I../dist/include/nsprpub  -I/usr/pkg/include/nspr   -I/usr/pkg/include/nspr nsinstall.c
pathsub.c
exec sh ../build/unix/print-failed-commands.sh  gcc -o host_pathsub.o -c -I/usr/include -I/usr/pkg/include -I/usr/pkg/include/nspr -Wall -W -Wno-unused -Wpointer-arith -Wcast-align -W -pedantic -Wno-long-long -O2 -I/usr/include -I/usr/pkg/include -I/usr/pkg/include/nspr -fno-strict-aliasing -Dunix -pthread -pipe -DNDEBUG -DTRIMMED -O3 -DXP_UNIX -O3  -DUNICODE -D_UNICODE  -I. -I. -I../dist/include -I../dist/include/nsprpub  -I/usr/pkg/include/nspr   -I/usr/pkg/include/nspr pathsub.c
gcc -o nsinstall -I/usr/include -I/usr/pkg/include -I/usr/pkg/include/nspr -Wall -W -Wno-unused -Wpointer-arith -Wcast-align -W -pedantic -Wno-long-long -O2 -I/usr/include -I/usr/pkg/include -I/usr/pkg/include/nspr -fno-strict-aliasing -Dunix -pthread -pipe -DNDEBUG -DTRIMMED -O3 -DXP_UNIX -O3  -DUNICODE -D_UNICODE -lpthread -Wl,-zrelro -L/usr/lib -Wl,-R/usr/lib -L/usr/pkg/lib -L/usr/pkg/lib/nspr -Wl,-R/usr/pkg/lib/nspr -Wl,-R/usr/pkg/lib  -Wl,-rpath-link,/bin -Wl,-rpath-link,/usr/pkg/lib  host_nsinstall.o host_pathsub.o  
gmake[2]: Leaving directory '/tmp/pkgbuild/lang/spidermonkey185/work.aarch64eb/js-1.8.5/js/src/config'
Creating /tmp/pkgbuild/lang/spidermonkey185/work.aarch64eb/js-1.8.5/js/src/.deps
gmake[2]: Entering directory '/tmp/pkgbuild/lang/spidermonkey185/work.aarch64eb/js-1.8.5/js/src/config'
rm -f nfspwd
cp nfspwd.pl nfspwd
chmod +x nfspwd
/tmp/pkgbuild/lang/spidermonkey185/work.aarch64eb/js-1.8.5/js/src/config/nsinstall -R nsinstall ../dist/bin
gmake[2]: Leaving directory '/tmp/pkgbuild/lang/spidermonkey185/work.aarch64eb/js-1.8.5/js/src/config'
gmake[2]: Entering directory '/tmp/pkgbuild/lang/spidermonkey185/work.aarch64eb/js-1.8.5/js/src/editline'
Creating /tmp/pkgbuild/lang/spidermonkey185/work.aarch64eb/js-1.8.5/js/src/editline/.deps
gmake[2]: Leaving directory '/tmp/pkgbuild/lang/spidermonkey185/work.aarch64eb/js-1.8.5/js/src/editline'
gmake[2]: Entering directory '/tmp/pkgbuild/lang/spidermonkey185/work.aarch64eb/js-1.8.5/js/src/shell'
Creating /tmp/pkgbuild/lang/spidermonkey185/work.aarch64eb/js-1.8.5/js/src/shell/.deps
gmake[2]: Leaving directory '/tmp/pkgbuild/lang/spidermonkey185/work.aarch64eb/js-1.8.5/js/src/shell'
gmake[2]: Entering directory '/tmp/pkgbuild/lang/spidermonkey185/work.aarch64eb/js-1.8.5/js/src/jsapi-tests'
Creating /tmp/pkgbuild/lang/spidermonkey185/work.aarch64eb/js-1.8.5/js/src/jsapi-tests/.deps
gmake[2]: Leaving directory '/tmp/pkgbuild/lang/spidermonkey185/work.aarch64eb/js-1.8.5/js/src/jsapi-tests'
gmake[2]: Entering directory '/tmp/pkgbuild/lang/spidermonkey185/work.aarch64eb/js-1.8.5/js/src/tests'
gmake[2]: Nothing to be done for 'export'.
gmake[2]: Leaving directory '/tmp/pkgbuild/lang/spidermonkey185/work.aarch64eb/js-1.8.5/js/src/tests'
c++ -I/usr/include -I/usr/pkg/include -I/usr/pkg/include/nspr -fno-rtti -fno-exceptions -Wall -Wpointer-arith -Woverloaded-virtual -Wsynth -Wno-ctor-dtor-privacy -Wno-non-virtual-dtor -Wcast-align -Wno-invalid-offsetof -Wno-variadic-macros -Werror=return-type -pedantic -Wno-long-long -O2 -I/usr/include -I/usr/pkg/include -I/usr/pkg/include/nspr -fno-strict-aliasing -Dunix -pthread -pipe -DNDEBUG -DTRIMMED -O3 -fstrict-aliasing -fomit-frame-pointer -DUSE_SYSTEM_MALLOC=1 -DENABLE_ASSEMBLER=1 -DENABLE_JIT=1  -DOSTYPE=\"NetBSD10\" -DOSARCH=NetBSD -DEXPORT_JS_API -D__STDC_LIMIT_MACROS -I/usr/pkg/include/nspr -o jscpucfg jscpucfg.cpp
jskwgen.cpp
exec sh ./build/unix/print-failed-commands.sh  c++ -o host_jskwgen.o -c -I/usr/include -I/usr/pkg/include -I/usr/pkg/include/nspr -fno-rtti -fno-exceptions -Wall -Wpointer-arith -Woverloaded-virtual -Wsynth -Wno-ctor-dtor-privacy -Wno-non-virtual-dtor -Wcast-align -Wno-invalid-offsetof -Wno-variadic-macros -Werror=return-type -pedantic -Wno-long-long -O2 -I/usr/include -I/usr/pkg/include -I/usr/pkg/include/nspr -fno-strict-aliasing -Dunix -pthread -pipe -DNDEBUG -DTRIMMED -O3 -fstrict-aliasing -fomit-frame-pointer -DUSE_SYSTEM_MALLOC=1 -DENABLE_ASSEMBLER=1 -DENABLE_JIT=1  -I. -I. -I./dist/include -I./dist/include/nsprpub  -I/usr/pkg/include/nspr   -I. -I./assembler -I./yarr -I/usr/pkg/include/nspr jskwgen.cpp
./jscpucfg > jsautocfg.tmp
mv jsautocfg.tmp jsautocfg.h
c++ -o host_jskwgen -I/usr/include -I/usr/pkg/include -I/usr/pkg/include/nspr -fno-rtti -fno-exceptions -Wall -Wpointer-arith -Woverloaded-virtual -Wsynth -Wno-ctor-dtor-privacy -Wno-non-virtual-dtor -Wcast-align -Wno-invalid-offsetof -Wno-variadic-macros -Werror=return-type -pedantic -Wno-long-long -O2 -I/usr/include -I/usr/pkg/include -I/usr/pkg/include/nspr -fno-strict-aliasing -Dunix -pthread -pipe -DNDEBUG -DTRIMMED -O3 -fstrict-aliasing -fomit-frame-pointer -DUSE_SYSTEM_MALLOC=1 -DENABLE_ASSEMBLER=1 -DENABLE_JIT=1  -I. -I. -I./dist/include -I./dist/include/nsprpub  -I/usr/pkg/include/nspr   -I. -I./assembler -I./yarr host_jskwgen.o  
./host_jskwgen /tmp/pkgbuild/lang/spidermonkey185/work.aarch64eb/js-1.8.5/js/src/jsautokw.h
/tmp/pkgbuild/lang/spidermonkey185/work.aarch64eb/js-1.8.5/js/src/config/nsinstall -R -m 644 js-config.h jsautocfg.h /tmp/pkgbuild/lang/spidermonkey185/work.aarch64eb/js-1.8.5/js/src/jsautokw.h js.msg jsanalyze.h jsapi.h jsarray.h jsarena.h jsatom.h jsbit.h jsbool.h jsclist.h jsclone.h jscntxt.h jscompat.h jsdate.h jsdbgapi.h jsdhash.h jsdtoa.h jsemit.h jsfun.h jsfriendapi.h jsgc.h jscell.h jsgcchunk.h jsgcstats.h jscompartment.h jshash.h jsinterp.h jsinttypes.h jsiter.h jslock.h jslong.h jsmath.h jsobj.h jsobjinlines.h json.h jsopcode.tbl jsopcode.h jsopcodeinlines.h jsotypes.h jsparse.h jsproxy.h jsprf.h jsprobes.h jspropertycache.h jspropertycacheinlines.h jspropertytree.h jsproto.tbl jsprvtd.h jspubtd.h jsreflect.h jsregexp.h jsscan.h jsscope.h jsscript.h jsscriptinlines.h jsstaticcheck.h jsstdint.h jsstr.h jstracer.h jshotloop.h jstypedarray.h jstypes.h jsutil.h jsvector.h jstl.h jshashtable.h jsversion.h jswrapper.h jsxdrapi.h jsxml.h jsval.h jsvalue.h prmjtime.h ./perf/jsperf.h ./dist/include
mkdir -p nanojit
gmake[1]: Leaving directory '/tmp/pkgbuild/lang/spidermonkey185/work.aarch64eb/js-1.8.5/js/src'
/usr/pkg/bin/gmake libs
gmake[1]: Entering directory '/tmp/pkgbuild/lang/spidermonkey185/work.aarch64eb/js-1.8.5/js/src'
jsoplengen.cpp
exec sh ./build/unix/print-failed-commands.sh  c++ -o host_jsoplengen.o -c -I/usr/include -I/usr/pkg/include -I/usr/pkg/include/nspr -fno-rtti -fno-exceptions -Wall -Wpointer-arith -Woverloaded-virtual -Wsynth -Wno-ctor-dtor-privacy -Wno-non-virtual-dtor -Wcast-align -Wno-invalid-offsetof -Wno-variadic-macros -Werror=return-type -pedantic -Wno-long-long -O2 -I/usr/include -I/usr/pkg/include -I/usr/pkg/include/nspr -fno-strict-aliasing -Dunix -pthread -pipe -DNDEBUG -DTRIMMED -O3 -fstrict-aliasing -fomit-frame-pointer -DUSE_SYSTEM_MALLOC=1 -DENABLE_ASSEMBLER=1 -DENABLE_JIT=1  -I. -I. -I./dist/include -I./dist/include/nsprpub  -I/usr/pkg/include/nspr   -I. -I./assembler -I./yarr -I/usr/pkg/include/nspr jsoplengen.cpp
c++ -o host_jsoplengen -I/usr/include -I/usr/pkg/include -I/usr/pkg/include/nspr -fno-rtti -fno-exceptions -Wall -Wpointer-arith -Woverloaded-virtual -Wsynth -Wno-ctor-dtor-privacy -Wno-non-virtual-dtor -Wcast-align -Wno-invalid-offsetof -Wno-variadic-macros -Werror=return-type -pedantic -Wno-long-long -O2 -I/usr/include -I/usr/pkg/include -I/usr/pkg/include/nspr -fno-strict-aliasing -Dunix -pthread -pipe -DNDEBUG -DTRIMMED -O3 -fstrict-aliasing -fomit-frame-pointer -DUSE_SYSTEM_MALLOC=1 -DENABLE_ASSEMBLER=1 -DENABLE_JIT=1  -I. -I. -I./dist/include -I./dist/include/nsprpub  -I/usr/pkg/include/nspr   -I. -I./assembler -I./yarr host_jsoplengen.o  
./host_jsoplengen /tmp/pkgbuild/lang/spidermonkey185/work.aarch64eb/js-1.8.5/js/src/jsautooplen.h
jsanalyze.cpp
exec sh ./build/unix/print-failed-commands.sh  c++ -o jsanalyze.o -c  -fvisibility=hidden -DOSTYPE=\"NetBSD10\" -DOSARCH=NetBSD -DEXPORT_JS_API -D__STDC_LIMIT_MACROS  -I. -I. -I./dist/include -I./dist/include/nsprpub  -I/usr/pkg/include/nspr   -I. -I./assembler -I./yarr  -fPIC -DPIC -I/usr/include -I/usr/pkg/include -I/usr/pkg/include/nspr -fno-rtti -fno-exceptions -Wall -Wpointer-arith -Woverloaded-virtual -Wsynth -Wno-ctor-dtor-privacy -Wno-non-virtual-dtor -Wcast-align -Wno-invalid-offsetof -Wno-variadic-macros -Werror=return-type -pedantic -Wno-long-long -O2 -I/usr/include -I/usr/pkg/include -I/usr/pkg/include/nspr -fno-strict-aliasing -Dunix -pthread -pipe -DNDEBUG -DTRIMMED -O3 -fstrict-aliasing -fomit-frame-pointer -DUSE_SYSTEM_MALLOC=1 -DENABLE_ASSEMBLER=1 -DENABLE_JIT=1  -I/usr/include -I/usr/pkg/include -I/usr/pkg/include/nspr -DMOZILLA_CLIENT -include ./js-confdefs.h -MD -MF .deps/jsanalyze.pp jsanalyze.cpp
jsapi.cpp
exec sh ./build/unix/print-failed-commands.sh  c++ -o jsapi.o -c  -fvisibility=hidden -DOSTYPE=\"NetBSD10\" -DOSARCH=NetBSD -DEXPORT_JS_API -D__STDC_LIMIT_MACROS  -I. -I. -I./dist/include -I./dist/include/nsprpub  -I/usr/pkg/include/nspr   -I. -I./assembler -I./yarr  -fPIC -DPIC -I/usr/include -I/usr/pkg/include -I/usr/pkg/include/nspr -fno-rtti -fno-exceptions -Wall -Wpointer-arith -Woverloaded-virtual -Wsynth -Wno-ctor-dtor-privacy -Wno-non-virtual-dtor -Wcast-align -Wno-invalid-offsetof -Wno-variadic-macros -Werror=return-type -pedantic -Wno-long-long -O2 -I/usr/include -I/usr/pkg/include -I/usr/pkg/include/nspr -fno-strict-aliasing -Dunix -pthread -pipe -DNDEBUG -DTRIMMED -O3 -fstrict-aliasing -fomit-frame-pointer -DUSE_SYSTEM_MALLOC=1 -DENABLE_ASSEMBLER=1 -DENABLE_JIT=1  -I/usr/include -I/usr/pkg/include -I/usr/pkg/include/nspr -DMOZILLA_CLIENT -include ./js-confdefs.h -MD -MF .deps/jsapi.pp jsapi.cpp
jsarena.cpp
exec sh ./build/unix/print-failed-commands.sh  c++ -o jsarena.o -c  -fvisibility=hidden -DOSTYPE=\"NetBSD10\" -DOSARCH=NetBSD -DEXPORT_JS_API -D__STDC_LIMIT_MACROS  -I. -I. -I./dist/include -I./dist/include/nsprpub  -I/usr/pkg/include/nspr   -I. -I./assembler -I./yarr  -fPIC -DPIC -I/usr/include -I/usr/pkg/include -I/usr/pkg/include/nspr -fno-rtti -fno-exceptions -Wall -Wpointer-arith -Woverloaded-virtual -Wsynth -Wno-ctor-dtor-privacy -Wno-non-virtual-dtor -Wcast-align -Wno-invalid-offsetof -Wno-variadic-macros -Werror=return-type -pedantic -Wno-long-long -O2 -I/usr/include -I/usr/pkg/include -I/usr/pkg/include/nspr -fno-strict-aliasing -Dunix -pthread -pipe -DNDEBUG -DTRIMMED -O3 -fstrict-aliasing -fomit-frame-pointer -DUSE_SYSTEM_MALLOC=1 -DENABLE_ASSEMBLER=1 -DENABLE_JIT=1  -I/usr/include -I/usr/pkg/include -I/usr/pkg/include/nspr -DMOZILLA_CLIENT -include ./js-confdefs.h -MD -MF .deps/jsarena.pp jsarena.cpp
jsarray.cpp
exec sh ./build/unix/print-failed-commands.sh  c++ -o jsarray.o -c  -fvisibility=hidden -DOSTYPE=\"NetBSD10\" -DOSARCH=NetBSD -DEXPORT_JS_API -D__STDC_LIMIT_MACROS  -I. -I. -I./dist/include -I./dist/include/nsprpub  -I/usr/pkg/include/nspr   -I. -I./assembler -I./yarr  -fPIC -DPIC -I/usr/include -I/usr/pkg/include -I/usr/pkg/include/nspr -fno-rtti -fno-exceptions -Wall -Wpointer-arith -Woverloaded-virtual -Wsynth -Wno-ctor-dtor-privacy -Wno-non-virtual-dtor -Wcast-align -Wno-invalid-offsetof -Wno-variadic-macros -Werror=return-type -pedantic -Wno-long-long -O2 -I/usr/include -I/usr/pkg/include -I/usr/pkg/include/nspr -fno-strict-aliasing -Dunix -pthread -pipe -DNDEBUG -DTRIMMED -O3 -fstrict-aliasing -fomit-frame-pointer -DUSE_SYSTEM_MALLOC=1 -DENABLE_ASSEMBLER=1 -DENABLE_JIT=1  -I/usr/include -I/usr/pkg/include -I/usr/pkg/include/nspr -DMOZILLA_CLIENT -include ./js-confdefs.h -MD -MF .deps/jsarray.pp jsarray.cpp
distcc[26148] ERROR: compile jsanalyze.cpp on 10.0.20.122:3760 failed
distcc[26148] (dcc_build_somewhere) Warning: remote compilation of 'jsanalyze.cpp' failed, retrying locally
distcc[26148] Warning: failed to distribute jsanalyze.cpp to 10.0.20.122:3760, running locally instead
In file included from jsval.h:48,
                 from jspubtd.h:47,
                 from jsprvtd.h:57,
                 from jscntxt.h:55,
                 from jsanalyze.h:45,
                 from jsanalyze.cpp:40:
jsutil.h: In function 'T* js_array_new(size_t)':
jsutil.h:302:5: warning: this 'if' clause does not guard... [-Wmisleading-indentation]
  302 |     if (!memory)
      |     ^~
jsutil.h:304:2: note: ...this statement, but the latter is misleadingly indented as if it were guarded by the 'if'
  304 |  *(size_t *)memory = n;
      |  ^
In file included from jsatom.h:47,
                 from jscntxt.h:59,
                 from jsanalyze.h:45,
                 from jsanalyze.cpp:40:
jsapi.h: At global scope:
jsapi.h:1381:39: warning: ignoring attributes on template argument 'jsval' {aka 'long unsigned int'} [-Wignored-attributes]
 1381 | template<> class AnchorPermitted<jsval> { };
      |                                       ^
distcc[16710] ERROR: compile jsapi.cpp on 10.0.20.122:3760 failed
distcc[16710] (dcc_build_somewhere) Warning: remote compilation of 'jsapi.cpp' failed, retrying locally
distcc[16710] Warning: failed to distribute jsapi.cpp to 10.0.20.122:3760, running locally instead
In file included from jsobj.h:64,
                 from jsstr.h:56,
                 from jsatom.h:52,
                 from jscntxt.h:59,
                 from jsanalyze.h:45,
                 from jsanalyze.cpp:40:
jsvalue.h: In member function 'const jsuword* js::Value::payloadWord() const':
jsvalue.h:732:32: error: 'const union jsval_layout::<unnamed struct>::<unnamed>' has no member named 'word'
  732 |         return &data.s.payload.word;
      |                                ^~~~
In file included from jsapi.cpp:52:
jsutil.h: In function 'T* js_array_new(size_t)':
jsutil.h:302:5: warning: this 'if' clause does not guard... [-Wmisleading-indentation]
  302 |     if (!memory)
      |     ^~
jsutil.h:304:2: note: ...this statement, but the latter is misleadingly indented as if it were guarded by the 'if'
  304 |  *(size_t *)memory = n;
      |  ^
In file included from jsapi.cpp:56:
jsapi.h: At global scope:
jsapi.h:1381:39: warning: ignoring attributes on template argument 'jsval' {aka 'long unsigned int'} [-Wignored-attributes]
 1381 | template<> class AnchorPermitted<jsval> { };
      |                                       ^
distcc[25731] ERROR: compile jsarray.cpp on 10.0.20.122:3760 failed
distcc[25731] (dcc_build_somewhere) Warning: remote compilation of 'jsarray.cpp' failed, retrying locally
distcc[25731] Warning: failed to distribute jsarray.cpp to 10.0.20.122:3760, running locally instead
In file included from jsobj.h:64,
                 from jsstr.h:56,
                 from jsatom.h:52,
                 from jsarray.h:47,
                 from jsapi.cpp:57:
jsvalue.h: In member function 'const jsuword* js::Value::payloadWord() const':
jsvalue.h:732:32: error: 'const union jsval_layout::<unnamed struct>::<unnamed>' has no member named 'word'
  732 |         return &data.s.payload.word;
      |                                ^~~~
In file included from jsarray.cpp:84:
jsutil.h: In function 'T* js_array_new(size_t)':
jsutil.h:302:5: warning: this 'if' clause does not guard... [-Wmisleading-indentation]
  302 |     if (!memory)
      |     ^~
jsutil.h:304:2: note: ...this statement, but the latter is misleadingly indented as if it were guarded by the 'if'
  304 |  *(size_t *)memory = n;
      |  ^
In file included from jsarray.cpp:85:
jsapi.h: At global scope:
jsapi.h:1381:39: warning: ignoring attributes on template argument 'jsval' {aka 'long unsigned int'} [-Wignored-attributes]
 1381 | template<> class AnchorPermitted<jsval> { };
      |                                       ^
In file included from jsobj.h:64,
                 from jsstr.h:56,
                 from jsatom.h:52,
                 from jsarray.h:47,
                 from jsarray.cpp:86:
jsvalue.h: In member function 'const jsuword* js::Value::payloadWord() const':
jsvalue.h:732:32: error: 'const union jsval_layout::<unnamed struct>::<unnamed>' has no member named 'word'
  732 |         return &data.s.payload.word;
      |                                ^~~~
In file included from jsval.h:48,
                 from jspubtd.h:47,
                 from jsprvtd.h:57,
                 from jscntxt.h:55,
                 from jsanalyze.h:45,
                 from jsanalyze.cpp:40:
jsutil.h: In instantiation of 'void js::PodZero(T*) [with T = js::analyze::Bytecode]':
jsanalyze.h:87:21:   required from here
jsutil.h:422:11: warning: 'void* memset(void*, int, size_t)' clearing an object of non-trivial type 'struct js::analyze::Bytecode'; use assignment or value-initialization instead [-Wclass-memaccess]
  422 |     memset(t, 0, sizeof(T));
      |     ~~~~~~^~~~~~~~~~~~~~~~~
In file included from jsanalyze.cpp:40:
jsanalyze.h:56:8: note: 'struct js::analyze::Bytecode' declared here
   56 | struct Bytecode
      |        ^~~~~~~~
distcc[26148] ERROR: compile jsanalyze.cpp on localhost failed

In the directory  /tmp/pkgbuild/lang/spidermonkey185/work.aarch64eb/js-1.8.5/js/src
The following command failed to execute properly:
c++ -o jsanalyze.o -c -fvisibility=hidden -DOSTYPE="NetBSD10" -DOSARCH=NetBSD -DEXPORT_JS_API -D__STDC_LIMIT_MACROS -I. -I. -I./dist/include -I./dist/include/nsprpub -I/usr/pkg/include/nspr -I. -I./assembler -I./yarr -fPIC -DPIC -I/usr/include -I/usr/pkg/include -I/usr/pkg/include/nspr -fno-rtti -fno-exceptions -Wall -Wpointer-arith -Woverloaded-virtual -Wsynth -Wno-ctor-dtor-privacy -Wno-non-virtual-dtor -Wcast-align -Wno-invalid-offsetof -Wno-variadic-macros -Werror=return-type -pedantic -Wno-long-long -O2 -I/usr/include -I/usr/pkg/include -I/usr/pkg/include/nspr -fno-strict-aliasing -Dunix -pthread -pipe -DNDEBUG -DTRIMMED -O3 -fstrict-aliasing -fomit-frame-pointer -DUSE_SYSTEM_MALLOC=1 -DENABLE_ASSEMBLER=1 -DENABLE_JIT=1 -I/usr/include -I/usr/pkg/include -I/usr/pkg/include/nspr -DMOZILLA_CLIENT -include ./js-confdefs.h -MD -MF .deps/jsanalyze.pp jsanalyze.cpp
gmake[1]: *** [config/rules.mk:1477: jsanalyze.o] Error 1
gmake[1]: *** Waiting for unfinished jobs....
In file included from jsapi.cpp:94:
jsobjinlines.h: In member function 'void JSObject::setArrayLength(uint32)':
jsobjinlines.h:316:16: warning: cast to pointer from integer of different size [-Wint-to-pointer-cast]
  316 |     setPrivate((void*) length);
      |                ^~~~~~~~~~~~~~
In file included from jsarray.cpp:110:
jsobjinlines.h: In member function 'void JSObject::setArrayLength(uint32)':
jsobjinlines.h:316:16: warning: cast to pointer from integer of different size [-Wint-to-pointer-cast]
  316 |     setPrivate((void*) length);
      |                ^~~~~~~~~~~~~~
jsapi.cpp: In function 'JSIdArray* JS_Enumerate(JSContext*, JSObject*)':
jsapi.cpp:3988:16: warning: converting 'false' to pointer type 'JSIdArray*' [-Wconversion-null]
 3988 |         return false;
      |                ^~~~~
jsapi.cpp: In function 'JSObject* JS_New(JSContext*, JSObject*, uintN, jsval*)':
jsapi.cpp:5182:51: warning: 'void* memcpy(void*, const void*, size_t)' copying an object of type 'class js::Value' with 'private' member 'js::Value::data' from an array of 'jsval' {aka 'long unsigned int'}; use assignment or copy-initialization instead [-Wclass-memaccess]
 5182 |     memcpy(args.argv(), argv, argc * sizeof(jsval));
      |                                                   ^
In file included from jsobj.h:64,
                 from jsstr.h:56,
                 from jsatom.h:52,
                 from jsarray.h:47,
                 from jsapi.cpp:57:
jsvalue.h:331:7: note: 'class js::Value' declared here
  331 | class Value
      |       ^~~~~
distcc[25731] ERROR: compile jsarray.cpp on localhost failed

In the directory  /tmp/pkgbuild/lang/spidermonkey185/work.aarch64eb/js-1.8.5/js/src
The following command failed to execute properly:
c++ -o jsarray.o -c -fvisibility=hidden -DOSTYPE="NetBSD10" -DOSARCH=NetBSD -DEXPORT_JS_API -D__STDC_LIMIT_MACROS -I. -I. -I./dist/include -I./dist/include/nsprpub -I/usr/pkg/include/nspr -I. -I./assembler -I./yarr -fPIC -DPIC -I/usr/include -I/usr/pkg/include -I/usr/pkg/include/nspr -fno-rtti -fno-exceptions -Wall -Wpointer-arith -Woverloaded-virtual -Wsynth -Wno-ctor-dtor-privacy -Wno-non-virtual-dtor -Wcast-align -Wno-invalid-offsetof -Wno-variadic-macros -Werror=return-type -pedantic -Wno-long-long -O2 -I/usr/include -I/usr/pkg/include -I/usr/pkg/include/nspr -fno-strict-aliasing -Dunix -pthread -pipe -DNDEBUG -DTRIMMED -O3 -fstrict-aliasing -fomit-frame-pointer -DUSE_SYSTEM_MALLOC=1 -DENABLE_ASSEMBLER=1 -DENABLE_JIT=1 -I/usr/include -I/usr/pkg/include -I/usr/pkg/include/nspr -DMOZILLA_CLIENT -include ./js-confdefs.h -MD -MF .deps/jsarray.pp jsarray.cpp
gmake[1]: *** [config/rules.mk:1477: jsarray.o] Error 1
distcc[16710] ERROR: compile jsapi.cpp on localhost failed

In the directory  /tmp/pkgbuild/lang/spidermonkey185/work.aarch64eb/js-1.8.5/js/src
The following command failed to execute properly:
c++ -o jsapi.o -c -fvisibility=hidden -DOSTYPE="NetBSD10" -DOSARCH=NetBSD -DEXPORT_JS_API -D__STDC_LIMIT_MACROS -I. -I. -I./dist/include -I./dist/include/nsprpub -I/usr/pkg/include/nspr -I. -I./assembler -I./yarr -fPIC -DPIC -I/usr/include -I/usr/pkg/include -I/usr/pkg/include/nspr -fno-rtti -fno-exceptions -Wall -Wpointer-arith -Woverloaded-virtual -Wsynth -Wno-ctor-dtor-privacy -Wno-non-virtual-dtor -Wcast-align -Wno-invalid-offsetof -Wno-variadic-macros -Werror=return-type -pedantic -Wno-long-long -O2 -I/usr/include -I/usr/pkg/include -I/usr/pkg/include/nspr -fno-strict-aliasing -Dunix -pthread -pipe -DNDEBUG -DTRIMMED -O3 -fstrict-aliasing -fomit-frame-pointer -DUSE_SYSTEM_MALLOC=1 -DENABLE_ASSEMBLER=1 -DENABLE_JIT=1 -I/usr/include -I/usr/pkg/include -I/usr/pkg/include/nspr -DMOZILLA_CLIENT -include ./js-confdefs.h -MD -MF .deps/jsapi.pp jsapi.cpp
gmake[1]: *** [config/rules.mk:1477: jsapi.o] Error 1
gmake[1]: Leaving directory '/tmp/pkgbuild/lang/spidermonkey185/work.aarch64eb/js-1.8.5/js/src'
gmake: *** [config/rules.mk:754: all] Error 2
*** Error code 2

Stop.
make[1]: stopped in /usr/pkgsrc/lang/spidermonkey185
*** Error code 1

Stop.
make: stopped in /usr/pkgsrc/lang/spidermonkey185