=> Bootstrap dependency digest>=20211023: found digest-20220214
===> Skipping vulnerability checks.
WARNING: No /usr/pkg/pkgdb/pkg-vulnerabilities file found.
WARNING: To fix run: `/usr/sbin/pkg_admin -K /usr/pkg/pkgdb fetch-pkg-vulnerabilities'.
===> Building for volk-2.5.2nb1
[  1%] Generating volk_machine_neon_orc.c
[  2%] Shebangin volk_modtool
[  3%] Generating __init__.pyo, cfg.pyo, volk_modtool_generate.pyo
[  3%] Built target pygen_python_volk_modtool_4c8c0
[  4%] Generating volk_machine_neonv8.c
[  5%] Generating __init__.pyc, cfg.pyc, volk_modtool_generate.pyc
[  5%] Built target pygen_python_volk_modtool_ccbe7
[  7%] Generating ../include/volk/volk.h
[  8%] Generating ../include/volk/volk_config_fixed.h
[  9%] Generating ../include/volk/volk_cpu.h
[ 10%] Generating ../include/volk/volk_typedefs.h
[ 11%] Generating volk.c
[ 12%] Generating volk_16ic_deinterleave_16i_x2_a_orc_impl.c
[ 14%] Generating volk_16ic_deinterleave_real_8i_a_orc_impl.c
[ 15%] Generating volk_16ic_magnitude_16i_a_orc_impl.c
[ 16%] Generating volk_16ic_s32f_deinterleave_32f_x2_a_orc_impl.c
[ 17%] Generating volk_16sc_magnitude_32f_aligned16_orc_impl.c
[ 18%] Generating volk_16u_byteswap_a_orc_impl.c
[ 20%] Generating volk_32f_s32f_add_32f_a_orc_impl.c
[ 21%] Generating volk_32f_s32f_multiply_32f_a_orc_impl.c
[ 22%] Generating volk_32f_s32f_normalize_a_orc_impl.c
[ 23%] Generating volk_32f_sqrt_32f_a_orc_impl.c
[ 24%] Generating volk_32f_x2_add_32f_a_orc_impl.c
[ 25%] Generating volk_32f_x2_divide_32f_a_orc_impl.c
[ 27%] Generating volk_32f_x2_dot_prod_32f_a_orc_impl.c
[ 28%] Generating volk_32f_x2_max_32f_a_orc_impl.c
[ 29%] Generating volk_32f_x2_min_32f_a_orc_impl.c
[ 30%] Generating volk_32f_x2_multiply_32f_a_orc_impl.c
[ 31%] Generating volk_32fc_32f_multiply_32fc_a_orc_impl.c
[ 32%] Generating volk_32f_x2_subtract_32f_a_orc_impl.c
[ 34%] Generating volk_32fc_magnitude_32f_a_orc_impl.c
[ 35%] Generating volk_32fc_s32fc_multiply_32fc_a_orc_impl.c
[ 36%] Generating volk_32i_x2_and_32i_a_orc_impl.c
[ 37%] Generating volk_32fc_x2_multiply_32fc_a_orc_impl.c
[ 38%] Generating volk_32i_x2_or_32i_a_orc_impl.c
[ 40%] Generating volk_8i_convert_16i_a_orc_impl.c
[ 41%] Generating volk_cpu.c
[ 42%] Generating volk_8i_s32f_convert_32f_a_orc_impl.c
[ 43%] Generating volk_machine_generic_orc.c
[ 44%] Generating volk_machines.c
[ 45%] Generating volk_machines.h
[ 48%] Building C object lib/CMakeFiles/volk_obj.dir/constants.c.o
[ 48%] Building C object lib/CMakeFiles/volk_obj.dir/volk_prefs.c.o
[ 49%] Building C object lib/CMakeFiles/volk_obj.dir/volk_rank_archs.c.o
[ 50%] Building C object lib/CMakeFiles/volk_obj.dir/volk_malloc.c.o
[ 51%] Building C object lib/CMakeFiles/volk_obj.dir/volk_machine_neon_orc.c.o
[ 52%] Building C object lib/CMakeFiles/volk_obj.dir/volk_machine_neonv8.c.o
[ 54%] Building C object lib/CMakeFiles/volk_obj.dir/volk_16ic_deinterleave_16i_x2_a_orc_impl.c.o
[ 55%] Building C object lib/CMakeFiles/volk_obj.dir/volk_16ic_deinterleave_real_8i_a_orc_impl.c.o
[ 56%] Building C object lib/CMakeFiles/volk_obj.dir/volk_16ic_magnitude_16i_a_orc_impl.c.o
[ 57%] Building C object lib/CMakeFiles/volk_obj.dir/volk_16ic_s32f_deinterleave_32f_x2_a_orc_impl.c.o
[ 58%] Building C object lib/CMakeFiles/volk_obj.dir/volk_16sc_magnitude_32f_aligned16_orc_impl.c.o
[ 60%] Building C object lib/CMakeFiles/volk_obj.dir/volk_16u_byteswap_a_orc_impl.c.o
[ 61%] Building C object lib/CMakeFiles/volk_obj.dir/volk_32f_s32f_add_32f_a_orc_impl.c.o
[ 62%] Building C object lib/CMakeFiles/volk_obj.dir/volk_32f_s32f_multiply_32f_a_orc_impl.c.o
[ 63%] Building C object lib/CMakeFiles/volk_obj.dir/volk_32f_s32f_normalize_a_orc_impl.c.o
[ 64%] Building C object lib/CMakeFiles/volk_obj.dir/volk_32f_sqrt_32f_a_orc_impl.c.o
[ 65%] Building C object lib/CMakeFiles/volk_obj.dir/volk_32f_x2_add_32f_a_orc_impl.c.o
[ 67%] Building C object lib/CMakeFiles/volk_obj.dir/volk_32f_x2_dot_prod_32f_a_orc_impl.c.o
[ 68%] Building C object lib/CMakeFiles/volk_obj.dir/volk_32f_x2_divide_32f_a_orc_impl.c.o
[ 69%] Building C object lib/CMakeFiles/volk_obj.dir/volk_32f_x2_max_32f_a_orc_impl.c.o
[ 70%] Building C object lib/CMakeFiles/volk_obj.dir/volk_32f_x2_min_32f_a_orc_impl.c.o
[ 71%] Building C object lib/CMakeFiles/volk_obj.dir/volk_32f_x2_multiply_32f_a_orc_impl.c.o
[ 72%] Building C object lib/CMakeFiles/volk_obj.dir/volk_32f_x2_subtract_32f_a_orc_impl.c.o
[ 74%] Building C object lib/CMakeFiles/volk_obj.dir/volk_32fc_32f_multiply_32fc_a_orc_impl.c.o
[ 75%] Building C object lib/CMakeFiles/volk_obj.dir/volk_32fc_magnitude_32f_a_orc_impl.c.o
[ 76%] Building C object lib/CMakeFiles/volk_obj.dir/volk_32fc_s32fc_multiply_32fc_a_orc_impl.c.o
[ 77%] Building C object lib/CMakeFiles/volk_obj.dir/volk_32fc_x2_multiply_32fc_a_orc_impl.c.o
[ 78%] Building C object lib/CMakeFiles/volk_obj.dir/volk_32i_x2_and_32i_a_orc_impl.c.o
[ 80%] Building C object lib/CMakeFiles/volk_obj.dir/volk_32i_x2_or_32i_a_orc_impl.c.o
[ 81%] Building C object lib/CMakeFiles/volk_obj.dir/volk_8i_convert_16i_a_orc_impl.c.o
[ 82%] Building C object lib/CMakeFiles/volk_obj.dir/volk_8i_s32f_convert_32f_a_orc_impl.c.o
[ 83%] Building C object lib/CMakeFiles/volk_obj.dir/volk.c.o
[ 84%] Building C object lib/CMakeFiles/volk_obj.dir/volk_cpu.c.o
/tmp/pkgbuild/math/volk/work.aarch64eb/volk-2.5.2/lib/volk_cpu.c:21:10: fatal error: cpu_features_macros.h: No such file or directory
   21 | #include "cpu_features_macros.h"
      |          ^~~~~~~~~~~~~~~~~~~~~~~
compilation terminated.
distcc[10219] ERROR: compile /tmp/pkgbuild/math/volk/work.aarch64eb/volk-2.5.2/lib/volk_cpu.c on 10.0.20.122:3760 failed
distcc[10219] (dcc_build_somewhere) Warning: remote compilation of '/tmp/pkgbuild/math/volk/work.aarch64eb/volk-2.5.2/lib/volk_cpu.c' failed, retrying locally
distcc[10219] Warning: failed to distribute /tmp/pkgbuild/math/volk/work.aarch64eb/volk-2.5.2/lib/volk_cpu.c to 10.0.20.122:3760, running locally instead
[ 85%] Building C object lib/CMakeFiles/volk_obj.dir/volk_machines.c.o
distcc[28499] (dcc_build_somewhere) Warning: failed to distribute, running locally instead
/tmp/pkgbuild/math/volk/work.aarch64eb/volk-2.5.2/lib/volk_cpu.c:21:10: fatal error: cpu_features_macros.h: No such file or directory
   21 | #include "cpu_features_macros.h"
      |          ^~~~~~~~~~~~~~~~~~~~~~~
compilation terminated.
distcc[10219] ERROR: compile /tmp/pkgbuild/math/volk/work.aarch64eb/volk-2.5.2/lib/volk_cpu.c on localhost failed
--- lib/CMakeFiles/volk_obj.dir/volk_cpu.c.o ---
*** [lib/CMakeFiles/volk_obj.dir/volk_cpu.c.o] Error code 1

make[2]: stopped in /tmp/pkgbuild/math/volk/work.aarch64eb/volk-2.5.2
1 error

make[2]: stopped in /tmp/pkgbuild/math/volk/work.aarch64eb/volk-2.5.2
--- lib/CMakeFiles/volk_obj.dir/all ---
*** [lib/CMakeFiles/volk_obj.dir/all] Error code 2

make[1]: stopped in /tmp/pkgbuild/math/volk/work.aarch64eb/volk-2.5.2
1 error

make[1]: stopped in /tmp/pkgbuild/math/volk/work.aarch64eb/volk-2.5.2
*** [all] Error code 2

make: stopped in /tmp/pkgbuild/math/volk/work.aarch64eb/volk-2.5.2
1 error

make: stopped in /tmp/pkgbuild/math/volk/work.aarch64eb/volk-2.5.2
*** Error code 2

Stop.
make[1]: stopped in /usr/pkgsrc/math/volk
*** Error code 1

Stop.
make: stopped in /usr/pkgsrc/math/volk