=> Bootstrap dependency digest>=20211023: found digest-20220214
===> Skipping vulnerability checks.
WARNING: No /usr/pkg/pkgdb/pkg-vulnerabilities file found.
WARNING: To fix run: `/usr/sbin/pkg_admin -K /usr/pkg/pkgdb fetch-pkg-vulnerabilities'.
===> Building for xosview2-2.3.3nb2
--- cmeterlib ---
--- meterlib ---
--- xwin.o ---
--- cmeterlib ---
cd /tmp/pkgbuild/sysutils/xosview2/work.aarch64eb/xosview2-2.3.3/cmeter && /usr/bin/make
--- meterlib ---
cd /tmp/pkgbuild/sysutils/xosview2/work.aarch64eb/xosview2-2.3.3/bsd && /usr/bin/make
--- xwin.o ---
c++ -O2 -I/usr/pkg/include -I/usr/X11R7/include -I/usr/include -I/usr/pkg/include/freetype2 -DPNG_NO_ASSEMBLER_CODE -I/usr/pkg/include -I/usr/X11R7/include -I/usr/include -I/usr/pkg/include/freetype2 -I/usr/X11R7/include -I/tmp/pkgbuild/sysutils/xosview2/work.aarch64eb/xosview2-2.3.3 -I/tmp/pkgbuild/sysutils/xosview2/work.aarch64eb/xosview2-2.3.3/cmeter -I/tmp/pkgbuild/sysutils/xosview2/work.aarch64eb/xosview2-2.3.3/bsd -DHAVE_CONFIG_H -c xwin.cc -o xwin.o
--- cmeterlib ---
--- meter.o ---
--- meterlib ---
--- btrymeter.o ---
c++ -O2 -I/usr/pkg/include -I/usr/X11R7/include -I/usr/include -I/usr/pkg/include/freetype2 -DPNG_NO_ASSEMBLER_CODE -I/usr/pkg/include -I/usr/X11R7/include -I/usr/include -I/usr/pkg/include/freetype2 -I/usr/X11R7/include -I/tmp/pkgbuild/sysutils/xosview2/work.aarch64eb/xosview2-2.3.3 -I/tmp/pkgbuild/sysutils/xosview2/work.aarch64eb/xosview2-2.3.3/cmeter -I/tmp/pkgbuild/sysutils/xosview2/work.aarch64eb/xosview2-2.3.3/bsd -DHAVE_CONFIG_H -c btrymeter.cc -o btrymeter.o
--- cmeterlib ---
c++ -O2 -I/usr/pkg/include -I/usr/X11R7/include -I/usr/include -I/usr/pkg/include/freetype2 -DPNG_NO_ASSEMBLER_CODE -I/usr/pkg/include -I/usr/X11R7/include -I/usr/include -I/usr/pkg/include/freetype2 -I/usr/X11R7/include -I/tmp/pkgbuild/sysutils/xosview2/work.aarch64eb/xosview2-2.3.3 -I/tmp/pkgbuild/sysutils/xosview2/work.aarch64eb/xosview2-2.3.3/cmeter -I/tmp/pkgbuild/sysutils/xosview2/work.aarch64eb/xosview2-2.3.3/bsd -DHAVE_CONFIG_H -c meter.cc -o meter.o
--- fieldmeter.o ---
c++ -O2 -I/usr/pkg/include -I/usr/X11R7/include -I/usr/include -I/usr/pkg/include/freetype2 -DPNG_NO_ASSEMBLER_CODE -I/usr/pkg/include -I/usr/X11R7/include -I/usr/include -I/usr/pkg/include/freetype2 -I/usr/X11R7/include -I/tmp/pkgbuild/sysutils/xosview2/work.aarch64eb/xosview2-2.3.3 -I/tmp/pkgbuild/sysutils/xosview2/work.aarch64eb/xosview2-2.3.3/cmeter -I/tmp/pkgbuild/sysutils/xosview2/work.aarch64eb/xosview2-2.3.3/bsd -DHAVE_CONFIG_H -c fieldmeter.cc -o fieldmeter.o
--- meterlib ---
--- cpumeter.o ---
c++ -O2 -I/usr/pkg/include -I/usr/X11R7/include -I/usr/include -I/usr/pkg/include/freetype2 -DPNG_NO_ASSEMBLER_CODE -I/usr/pkg/include -I/usr/X11R7/include -I/usr/include -I/usr/pkg/include/freetype2 -I/usr/X11R7/include -I/tmp/pkgbuild/sysutils/xosview2/work.aarch64eb/xosview2-2.3.3 -I/tmp/pkgbuild/sysutils/xosview2/work.aarch64eb/xosview2-2.3.3/cmeter -I/tmp/pkgbuild/sysutils/xosview2/work.aarch64eb/xosview2-2.3.3/bsd -DHAVE_CONFIG_H -c cpumeter.cc -o cpumeter.o
--- x11graphics.o ---
c++ -O2 -I/usr/pkg/include -I/usr/X11R7/include -I/usr/include -I/usr/pkg/include/freetype2 -DPNG_NO_ASSEMBLER_CODE -I/usr/pkg/include -I/usr/X11R7/include -I/usr/include -I/usr/pkg/include/freetype2 -I/usr/X11R7/include -I/tmp/pkgbuild/sysutils/xosview2/work.aarch64eb/xosview2-2.3.3 -I/tmp/pkgbuild/sysutils/xosview2/work.aarch64eb/xosview2-2.3.3/cmeter -I/tmp/pkgbuild/sysutils/xosview2/work.aarch64eb/xosview2-2.3.3/bsd -DHAVE_CONFIG_H -c x11graphics.cc -o x11graphics.o
--- meterlib ---
--- diskmeter.o ---
c++ -O2 -I/usr/pkg/include -I/usr/X11R7/include -I/usr/include -I/usr/pkg/include/freetype2 -DPNG_NO_ASSEMBLER_CODE -I/usr/pkg/include -I/usr/X11R7/include -I/usr/include -I/usr/pkg/include/freetype2 -I/usr/X11R7/include -I/tmp/pkgbuild/sysutils/xosview2/work.aarch64eb/xosview2-2.3.3 -I/tmp/pkgbuild/sysutils/xosview2/work.aarch64eb/xosview2-2.3.3/cmeter -I/tmp/pkgbuild/sysutils/xosview2/work.aarch64eb/xosview2-2.3.3/bsd -DHAVE_CONFIG_H -c diskmeter.cc -o diskmeter.o
--- cmeterlib ---
--- fieldmeterdecay.o ---
c++ -O2 -I/usr/pkg/include -I/usr/X11R7/include -I/usr/include -I/usr/pkg/include/freetype2 -DPNG_NO_ASSEMBLER_CODE -I/usr/pkg/include -I/usr/X11R7/include -I/usr/include -I/usr/pkg/include/freetype2 -I/usr/X11R7/include -I/tmp/pkgbuild/sysutils/xosview2/work.aarch64eb/xosview2-2.3.3 -I/tmp/pkgbuild/sysutils/xosview2/work.aarch64eb/xosview2-2.3.3/cmeter -I/tmp/pkgbuild/sysutils/xosview2/work.aarch64eb/xosview2-2.3.3/bsd -DHAVE_CONFIG_H -c fieldmeterdecay.cc -o fieldmeterdecay.o
--- x11font.o ---
c++ -O2 -I/usr/pkg/include -I/usr/X11R7/include -I/usr/include -I/usr/pkg/include/freetype2 -DPNG_NO_ASSEMBLER_CODE -I/usr/pkg/include -I/usr/X11R7/include -I/usr/include -I/usr/pkg/include/freetype2 -I/usr/X11R7/include -I/tmp/pkgbuild/sysutils/xosview2/work.aarch64eb/xosview2-2.3.3 -I/tmp/pkgbuild/sysutils/xosview2/work.aarch64eb/xosview2-2.3.3/cmeter -I/tmp/pkgbuild/sysutils/xosview2/work.aarch64eb/xosview2-2.3.3/bsd -DHAVE_CONFIG_H -c x11font.cc -o x11font.o
--- meterlib ---
diskmeter.cc: In member function 'virtual std::pair<double, double> DiskMeter::getRate()':
diskmeter.cc:34:50: note: parameter passing for argument of type 'std::pair<double, double>' when C++17 is enabled changed to match C++14 in GCC 10.1
--- intmeter.o ---
c++ -O2 -I/usr/pkg/include -I/usr/X11R7/include -I/usr/include -I/usr/pkg/include/freetype2 -DPNG_NO_ASSEMBLER_CODE -I/usr/pkg/include -I/usr/X11R7/include -I/usr/include -I/usr/pkg/include/freetype2 -I/usr/X11R7/include -I/tmp/pkgbuild/sysutils/xosview2/work.aarch64eb/xosview2-2.3.3 -I/tmp/pkgbuild/sysutils/xosview2/work.aarch64eb/xosview2-2.3.3/cmeter -I/tmp/pkgbuild/sysutils/xosview2/work.aarch64eb/xosview2-2.3.3/bsd -DHAVE_CONFIG_H -c intmeter.cc -o intmeter.o
--- x11pixmap.o ---
c++ -O2 -I/usr/pkg/include -I/usr/X11R7/include -I/usr/include -I/usr/pkg/include/freetype2 -DPNG_NO_ASSEMBLER_CODE -I/usr/pkg/include -I/usr/X11R7/include -I/usr/include -I/usr/pkg/include/freetype2 -I/usr/X11R7/include -I/tmp/pkgbuild/sysutils/xosview2/work.aarch64eb/xosview2-2.3.3 -I/tmp/pkgbuild/sysutils/xosview2/work.aarch64eb/xosview2-2.3.3/cmeter -I/tmp/pkgbuild/sysutils/xosview2/work.aarch64eb/xosview2-2.3.3/bsd -DHAVE_CONFIG_H -c x11pixmap.cc -o x11pixmap.o
--- cmeterlib ---
--- fieldmetergraph.o ---
c++ -O2 -I/usr/pkg/include -I/usr/X11R7/include -I/usr/include -I/usr/pkg/include/freetype2 -DPNG_NO_ASSEMBLER_CODE -I/usr/pkg/include -I/usr/X11R7/include -I/usr/include -I/usr/pkg/include/freetype2 -I/usr/X11R7/include -I/tmp/pkgbuild/sysutils/xosview2/work.aarch64eb/xosview2-2.3.3 -I/tmp/pkgbuild/sysutils/xosview2/work.aarch64eb/xosview2-2.3.3/cmeter -I/tmp/pkgbuild/sysutils/xosview2/work.aarch64eb/xosview2-2.3.3/bsd -DHAVE_CONFIG_H -c fieldmetergraph.cc -o fieldmetergraph.o
--- meterlib ---
--- intratemeter.o ---
c++ -O2 -I/usr/pkg/include -I/usr/X11R7/include -I/usr/include -I/usr/pkg/include/freetype2 -DPNG_NO_ASSEMBLER_CODE -I/usr/pkg/include -I/usr/X11R7/include -I/usr/include -I/usr/pkg/include/freetype2 -I/usr/X11R7/include -I/tmp/pkgbuild/sysutils/xosview2/work.aarch64eb/xosview2-2.3.3 -I/tmp/pkgbuild/sysutils/xosview2/work.aarch64eb/xosview2-2.3.3/cmeter -I/tmp/pkgbuild/sysutils/xosview2/work.aarch64eb/xosview2-2.3.3/bsd -DHAVE_CONFIG_H -c intratemeter.cc -o intratemeter.o
--- xsc.o ---
c++ -O2 -I/usr/pkg/include -I/usr/X11R7/include -I/usr/include -I/usr/pkg/include/freetype2 -DPNG_NO_ASSEMBLER_CODE -I/usr/pkg/include -I/usr/X11R7/include -I/usr/include -I/usr/pkg/include/freetype2 -I/usr/X11R7/include -I/tmp/pkgbuild/sysutils/xosview2/work.aarch64eb/xosview2-2.3.3 -I/tmp/pkgbuild/sysutils/xosview2/work.aarch64eb/xosview2-2.3.3/cmeter -I/tmp/pkgbuild/sysutils/xosview2/work.aarch64eb/xosview2-2.3.3/bsd -DHAVE_CONFIG_H -c xsc.cc -o xsc.o
--- cmeterlib ---
--- bitmeter.o ---
c++ -O2 -I/usr/pkg/include -I/usr/X11R7/include -I/usr/include -I/usr/pkg/include/freetype2 -DPNG_NO_ASSEMBLER_CODE -I/usr/pkg/include -I/usr/X11R7/include -I/usr/include -I/usr/pkg/include/freetype2 -I/usr/X11R7/include -I/tmp/pkgbuild/sysutils/xosview2/work.aarch64eb/xosview2-2.3.3 -I/tmp/pkgbuild/sysutils/xosview2/work.aarch64eb/xosview2-2.3.3/cmeter -I/tmp/pkgbuild/sysutils/xosview2/work.aarch64eb/xosview2-2.3.3/bsd -DHAVE_CONFIG_H -c bitmeter.cc -o bitmeter.o
--- meterlib ---
--- intrstats.o ---
c++ -O2 -I/usr/pkg/include -I/usr/X11R7/include -I/usr/include -I/usr/pkg/include/freetype2 -DPNG_NO_ASSEMBLER_CODE -I/usr/pkg/include -I/usr/X11R7/include -I/usr/include -I/usr/pkg/include/freetype2 -I/usr/X11R7/include -I/tmp/pkgbuild/sysutils/xosview2/work.aarch64eb/xosview2-2.3.3 -I/tmp/pkgbuild/sysutils/xosview2/work.aarch64eb/xosview2-2.3.3/cmeter -I/tmp/pkgbuild/sysutils/xosview2/work.aarch64eb/xosview2-2.3.3/bsd -DHAVE_CONFIG_H -c intrstats.cc -o intrstats.o
--- cmeterlib ---
--- bitfieldmeter.o ---
c++ -O2 -I/usr/pkg/include -I/usr/X11R7/include -I/usr/include -I/usr/pkg/include/freetype2 -DPNG_NO_ASSEMBLER_CODE -I/usr/pkg/include -I/usr/X11R7/include -I/usr/include -I/usr/pkg/include/freetype2 -I/usr/X11R7/include -I/tmp/pkgbuild/sysutils/xosview2/work.aarch64eb/xosview2-2.3.3 -I/tmp/pkgbuild/sysutils/xosview2/work.aarch64eb/xosview2-2.3.3/cmeter -I/tmp/pkgbuild/sysutils/xosview2/work.aarch64eb/xosview2-2.3.3/bsd -DHAVE_CONFIG_H -c bitfieldmeter.cc -o bitfieldmeter.o
--- Xrm.o ---
c++ -O2 -I/usr/pkg/include -I/usr/X11R7/include -I/usr/include -I/usr/pkg/include/freetype2 -DPNG_NO_ASSEMBLER_CODE -I/usr/pkg/include -I/usr/X11R7/include -I/usr/include -I/usr/pkg/include/freetype2 -I/usr/X11R7/include -I/tmp/pkgbuild/sysutils/xosview2/work.aarch64eb/xosview2-2.3.3 -I/tmp/pkgbuild/sysutils/xosview2/work.aarch64eb/xosview2-2.3.3/cmeter -I/tmp/pkgbuild/sysutils/xosview2/work.aarch64eb/xosview2-2.3.3/bsd -DHAVE_CONFIG_H -c Xrm.cc -o Xrm.o
--- meterlib ---
--- kernel.o ---
c++ -O2 -I/usr/pkg/include -I/usr/X11R7/include -I/usr/include -I/usr/pkg/include/freetype2 -DPNG_NO_ASSEMBLER_CODE -I/usr/pkg/include -I/usr/X11R7/include -I/usr/include -I/usr/pkg/include/freetype2 -I/usr/X11R7/include -I/tmp/pkgbuild/sysutils/xosview2/work.aarch64eb/xosview2-2.3.3 -I/tmp/pkgbuild/sysutils/xosview2/work.aarch64eb/xosview2-2.3.3/cmeter -I/tmp/pkgbuild/sysutils/xosview2/work.aarch64eb/xosview2-2.3.3/bsd -DHAVE_CONFIG_H -c kernel.cc -o kernel.o
--- cmeterlib ---
--- sensorfieldmeter.o ---
c++ -O2 -I/usr/pkg/include -I/usr/X11R7/include -I/usr/include -I/usr/pkg/include/freetype2 -DPNG_NO_ASSEMBLER_CODE -I/usr/pkg/include -I/usr/X11R7/include -I/usr/include -I/usr/pkg/include/freetype2 -I/usr/X11R7/include -I/tmp/pkgbuild/sysutils/xosview2/work.aarch64eb/xosview2-2.3.3 -I/tmp/pkgbuild/sysutils/xosview2/work.aarch64eb/xosview2-2.3.3/cmeter -I/tmp/pkgbuild/sysutils/xosview2/work.aarch64eb/xosview2-2.3.3/bsd -DHAVE_CONFIG_H -c sensorfieldmeter.cc -o sensorfieldmeter.o
--- meterlib ---
--- loadmeter.o ---
c++ -O2 -I/usr/pkg/include -I/usr/X11R7/include -I/usr/include -I/usr/pkg/include/freetype2 -DPNG_NO_ASSEMBLER_CODE -I/usr/pkg/include -I/usr/X11R7/include -I/usr/include -I/usr/pkg/include/freetype2 -I/usr/X11R7/include -I/tmp/pkgbuild/sysutils/xosview2/work.aarch64eb/xosview2-2.3.3 -I/tmp/pkgbuild/sysutils/xosview2/work.aarch64eb/xosview2-2.3.3/cmeter -I/tmp/pkgbuild/sysutils/xosview2/work.aarch64eb/xosview2-2.3.3/bsd -DHAVE_CONFIG_H -c loadmeter.cc -o loadmeter.o
--- cmeterlib ---
--- cswapmeter.o ---
c++ -O2 -I/usr/pkg/include -I/usr/X11R7/include -I/usr/include -I/usr/pkg/include/freetype2 -DPNG_NO_ASSEMBLER_CODE -I/usr/pkg/include -I/usr/X11R7/include -I/usr/include -I/usr/pkg/include/freetype2 -I/usr/X11R7/include -I/tmp/pkgbuild/sysutils/xosview2/work.aarch64eb/xosview2-2.3.3 -I/tmp/pkgbuild/sysutils/xosview2/work.aarch64eb/xosview2-2.3.3/cmeter -I/tmp/pkgbuild/sysutils/xosview2/work.aarch64eb/xosview2-2.3.3/bsd -DHAVE_CONFIG_H -c cswapmeter.cc -o cswapmeter.o
--- rdb.o ---
c++ -O2 -I/usr/pkg/include -I/usr/X11R7/include -I/usr/include -I/usr/pkg/include/freetype2 -DPNG_NO_ASSEMBLER_CODE -I/usr/pkg/include -I/usr/X11R7/include -I/usr/include -I/usr/pkg/include/freetype2 -I/usr/X11R7/include -I/tmp/pkgbuild/sysutils/xosview2/work.aarch64eb/xosview2-2.3.3 -I/tmp/pkgbuild/sysutils/xosview2/work.aarch64eb/xosview2-2.3.3/cmeter -I/tmp/pkgbuild/sysutils/xosview2/work.aarch64eb/xosview2-2.3.3/bsd -DHAVE_CONFIG_H -c rdb.cc -o rdb.o
--- meterlib ---
--- memmeter.o ---
c++ -O2 -I/usr/pkg/include -I/usr/X11R7/include -I/usr/include -I/usr/pkg/include/freetype2 -DPNG_NO_ASSEMBLER_CODE -I/usr/pkg/include -I/usr/X11R7/include -I/usr/include -I/usr/pkg/include/freetype2 -I/usr/X11R7/include -I/tmp/pkgbuild/sysutils/xosview2/work.aarch64eb/xosview2-2.3.3 -I/tmp/pkgbuild/sysutils/xosview2/work.aarch64eb/xosview2-2.3.3/cmeter -I/tmp/pkgbuild/sysutils/xosview2/work.aarch64eb/xosview2-2.3.3/bsd -DHAVE_CONFIG_H -c memmeter.cc -o memmeter.o
--- timer.o ---
c++ -O2 -I/usr/pkg/include -I/usr/X11R7/include -I/usr/include -I/usr/pkg/include/freetype2 -DPNG_NO_ASSEMBLER_CODE -I/usr/pkg/include -I/usr/X11R7/include -I/usr/include -I/usr/pkg/include/freetype2 -I/usr/X11R7/include -I/tmp/pkgbuild/sysutils/xosview2/work.aarch64eb/xosview2-2.3.3 -I/tmp/pkgbuild/sysutils/xosview2/work.aarch64eb/xosview2-2.3.3/cmeter -I/tmp/pkgbuild/sysutils/xosview2/work.aarch64eb/xosview2-2.3.3/bsd -DHAVE_CONFIG_H -c timer.cc -o timer.o
--- cmeterlib ---
--- pswapmeter.o ---
c++ -O2 -I/usr/pkg/include -I/usr/X11R7/include -I/usr/include -I/usr/pkg/include/freetype2 -DPNG_NO_ASSEMBLER_CODE -I/usr/pkg/include -I/usr/X11R7/include -I/usr/include -I/usr/pkg/include/freetype2 -I/usr/X11R7/include -I/tmp/pkgbuild/sysutils/xosview2/work.aarch64eb/xosview2-2.3.3 -I/tmp/pkgbuild/sysutils/xosview2/work.aarch64eb/xosview2-2.3.3/cmeter -I/tmp/pkgbuild/sysutils/xosview2/work.aarch64eb/xosview2-2.3.3/bsd -DHAVE_CONFIG_H -c pswapmeter.cc -o pswapmeter.o
--- defaultstring.cc ---
/usr/bin/awk -f defresources.awk Xdefaults > defaultstring.cc
--- label.o ---
c++ -O2 -I/usr/pkg/include -I/usr/X11R7/include -I/usr/include -I/usr/pkg/include/freetype2 -DPNG_NO_ASSEMBLER_CODE -I/usr/pkg/include -I/usr/X11R7/include -I/usr/include -I/usr/pkg/include/freetype2 -I/usr/X11R7/include -I/tmp/pkgbuild/sysutils/xosview2/work.aarch64eb/xosview2-2.3.3 -I/tmp/pkgbuild/sysutils/xosview2/work.aarch64eb/xosview2-2.3.3/cmeter -I/tmp/pkgbuild/sysutils/xosview2/work.aarch64eb/xosview2-2.3.3/bsd -DHAVE_CONFIG_H -c label.cc -o label.o
--- meterlib ---
--- netmeter.o ---
c++ -O2 -I/usr/pkg/include -I/usr/X11R7/include -I/usr/include -I/usr/pkg/include/freetype2 -DPNG_NO_ASSEMBLER_CODE -I/usr/pkg/include -I/usr/X11R7/include -I/usr/include -I/usr/pkg/include/freetype2 -I/usr/X11R7/include -I/tmp/pkgbuild/sysutils/xosview2/work.aarch64eb/xosview2-2.3.3 -I/tmp/pkgbuild/sysutils/xosview2/work.aarch64eb/xosview2-2.3.3/cmeter -I/tmp/pkgbuild/sysutils/xosview2/work.aarch64eb/xosview2-2.3.3/bsd -DHAVE_CONFIG_H -c netmeter.cc -o netmeter.o
--- cmeterlib ---
--- cloadmeter.o ---
c++ -O2 -I/usr/pkg/include -I/usr/X11R7/include -I/usr/include -I/usr/pkg/include/freetype2 -DPNG_NO_ASSEMBLER_CODE -I/usr/pkg/include -I/usr/X11R7/include -I/usr/include -I/usr/pkg/include/freetype2 -I/usr/X11R7/include -I/tmp/pkgbuild/sysutils/xosview2/work.aarch64eb/xosview2-2.3.3 -I/tmp/pkgbuild/sysutils/xosview2/work.aarch64eb/xosview2-2.3.3/cmeter -I/tmp/pkgbuild/sysutils/xosview2/work.aarch64eb/xosview2-2.3.3/bsd -DHAVE_CONFIG_H -c cloadmeter.cc -o cloadmeter.o
--- scache.o ---
c++ -O2 -I/usr/pkg/include -I/usr/X11R7/include -I/usr/include -I/usr/pkg/include/freetype2 -DPNG_NO_ASSEMBLER_CODE -I/usr/pkg/include -I/usr/X11R7/include -I/usr/include -I/usr/pkg/include/freetype2 -I/usr/X11R7/include -I/tmp/pkgbuild/sysutils/xosview2/work.aarch64eb/xosview2-2.3.3 -I/tmp/pkgbuild/sysutils/xosview2/work.aarch64eb/xosview2-2.3.3/cmeter -I/tmp/pkgbuild/sysutils/xosview2/work.aarch64eb/xosview2-2.3.3/bsd -DHAVE_CONFIG_H -c scache.cc -o scache.o
--- clopt.o ---
c++ -O2 -I/usr/pkg/include -I/usr/X11R7/include -I/usr/include -I/usr/pkg/include/freetype2 -DPNG_NO_ASSEMBLER_CODE -I/usr/pkg/include -I/usr/X11R7/include -I/usr/include -I/usr/pkg/include/freetype2 -I/usr/X11R7/include -I/tmp/pkgbuild/sysutils/xosview2/work.aarch64eb/xosview2-2.3.3 -I/tmp/pkgbuild/sysutils/xosview2/work.aarch64eb/xosview2-2.3.3/cmeter -I/tmp/pkgbuild/sysutils/xosview2/work.aarch64eb/xosview2-2.3.3/bsd -DHAVE_CONFIG_H -c clopt.cc -o clopt.o
--- meterlib ---
netmeter.cc: In member function 'virtual std::pair<float, float> NetMeter::getRates()':
netmeter.cc:70:48: note: parameter passing for argument of type 'std::pair<float, float>' when C++17 is enabled changed to match C++14 in GCC 10.1
In file included from /usr/include/g++/bits/stl_algobase.h:64,
                 from /usr/include/g++/bits/char_traits.h:39,
                 from /usr/include/g++/string:40,
                 from /tmp/pkgbuild/sysutils/xosview2/work.aarch64eb/xosview2-2.3.3/label.h:10,
                 from /tmp/pkgbuild/sysutils/xosview2/work.aarch64eb/xosview2-2.3.3/cmeter/meter.h:10,
                 from /tmp/pkgbuild/sysutils/xosview2/work.aarch64eb/xosview2-2.3.3/cmeter/fieldmeter.h:10,
                 from /tmp/pkgbuild/sysutils/xosview2/work.aarch64eb/xosview2-2.3.3/cmeter/fieldmeterdecay.h:19,
                 from /tmp/pkgbuild/sysutils/xosview2/work.aarch64eb/xosview2-2.3.3/cmeter/fieldmetergraph.h:15,
                 from /tmp/pkgbuild/sysutils/xosview2/work.aarch64eb/xosview2-2.3.3/cmeter/cnetmeter.h:10,
                 from netmeter.h:19,
                 from netmeter.cc:16:
/usr/include/g++/bits/stl_pair.h: In instantiation of 'constexpr std::pair<typename std::__strip_reference_wrapper<typename std::decay<_Tp>::type>::__type, typename std::__strip_reference_wrapper<typename std::decay<_Tp2>::type>::__type> std::make_pair(_T1&&, _T2&&) [with _T1 = double; _T2 = double; typename std::__strip_reference_wrapper<typename std::decay<_Tp2>::type>::__type = double; typename std::__strip_reference_wrapper<typename std::decay<_Tp>::type>::__type = double]':
netmeter.cc:76:39:   required from here
/usr/include/g++/bits/stl_pair.h:567:5: note: parameter passing for argument of type 'std::pair<double, double>' when C++17 is enabled changed to match C++14 in GCC 10.1
  567 |     make_pair(_T1&& __x, _T2&& __y)
      |     ^~~~~~~~~
netmeter.cc:70:25: note: parameter passing for argument of type 'std::pair<float, float>' when C++17 is enabled changed to match C++14 in GCC 10.1
--- pagemeter.o ---
c++ -O2 -I/usr/pkg/include -I/usr/X11R7/include -I/usr/include -I/usr/pkg/include/freetype2 -DPNG_NO_ASSEMBLER_CODE -I/usr/pkg/include -I/usr/X11R7/include -I/usr/include -I/usr/pkg/include/freetype2 -I/usr/X11R7/include -I/tmp/pkgbuild/sysutils/xosview2/work.aarch64eb/xosview2-2.3.3 -I/tmp/pkgbuild/sysutils/xosview2/work.aarch64eb/xosview2-2.3.3/cmeter -I/tmp/pkgbuild/sysutils/xosview2/work.aarch64eb/xosview2-2.3.3/bsd -DHAVE_CONFIG_H -c pagemeter.cc -o pagemeter.o
--- cmeterlib ---
--- ploadmeter.o ---
c++ -O2 -I/usr/pkg/include -I/usr/X11R7/include -I/usr/include -I/usr/pkg/include/freetype2 -DPNG_NO_ASSEMBLER_CODE -I/usr/pkg/include -I/usr/X11R7/include -I/usr/include -I/usr/pkg/include/freetype2 -I/usr/X11R7/include -I/tmp/pkgbuild/sysutils/xosview2/work.aarch64eb/xosview2-2.3.3 -I/tmp/pkgbuild/sysutils/xosview2/work.aarch64eb/xosview2-2.3.3/cmeter -I/tmp/pkgbuild/sysutils/xosview2/work.aarch64eb/xosview2-2.3.3/bsd -DHAVE_CONFIG_H -c ploadmeter.cc -o ploadmeter.o
--- meterlib ---
pagemeter.cc: In member function 'virtual std::pair<float, float> PageMeter::getPageRate()':
pagemeter.cc:41:52: note: parameter passing for argument of type 'std::pair<float, float>' when C++17 is enabled changed to match C++14 in GCC 10.1
--- swapmeter.o ---
c++ -O2 -I/usr/pkg/include -I/usr/X11R7/include -I/usr/include -I/usr/pkg/include/freetype2 -DPNG_NO_ASSEMBLER_CODE -I/usr/pkg/include -I/usr/X11R7/include -I/usr/include -I/usr/pkg/include/freetype2 -I/usr/X11R7/include -I/tmp/pkgbuild/sysutils/xosview2/work.aarch64eb/xosview2-2.3.3 -I/tmp/pkgbuild/sysutils/xosview2/work.aarch64eb/xosview2-2.3.3/cmeter -I/tmp/pkgbuild/sysutils/xosview2/work.aarch64eb/xosview2-2.3.3/bsd -DHAVE_CONFIG_H -c swapmeter.cc -o swapmeter.o
--- xosview.o ---
c++ -O2 -I/usr/pkg/include -I/usr/X11R7/include -I/usr/include -I/usr/pkg/include/freetype2 -DPNG_NO_ASSEMBLER_CODE -I/usr/pkg/include -I/usr/X11R7/include -I/usr/include -I/usr/pkg/include/freetype2 -I/usr/X11R7/include -I/tmp/pkgbuild/sysutils/xosview2/work.aarch64eb/xosview2-2.3.3 -I/tmp/pkgbuild/sysutils/xosview2/work.aarch64eb/xosview2-2.3.3/cmeter -I/tmp/pkgbuild/sysutils/xosview2/work.aarch64eb/xosview2-2.3.3/bsd -DHAVE_CONFIG_H -c xosview.cc -o xosview.o
--- cmeterlib ---
--- pmemmeter.o ---
c++ -O2 -I/usr/pkg/include -I/usr/X11R7/include -I/usr/include -I/usr/pkg/include/freetype2 -DPNG_NO_ASSEMBLER_CODE -I/usr/pkg/include -I/usr/X11R7/include -I/usr/include -I/usr/pkg/include/freetype2 -I/usr/X11R7/include -I/tmp/pkgbuild/sysutils/xosview2/work.aarch64eb/xosview2-2.3.3 -I/tmp/pkgbuild/sysutils/xosview2/work.aarch64eb/xosview2-2.3.3/cmeter -I/tmp/pkgbuild/sysutils/xosview2/work.aarch64eb/xosview2-2.3.3/bsd -DHAVE_CONFIG_H -c pmemmeter.cc -o pmemmeter.o
--- meterlib ---
--- fsmeter.o ---
c++ -O2 -I/usr/pkg/include -I/usr/X11R7/include -I/usr/include -I/usr/pkg/include/freetype2 -DPNG_NO_ASSEMBLER_CODE -I/usr/pkg/include -I/usr/X11R7/include -I/usr/include -I/usr/pkg/include/freetype2 -I/usr/X11R7/include -I/tmp/pkgbuild/sysutils/xosview2/work.aarch64eb/xosview2-2.3.3 -I/tmp/pkgbuild/sysutils/xosview2/work.aarch64eb/xosview2-2.3.3/cmeter -I/tmp/pkgbuild/sysutils/xosview2/work.aarch64eb/xosview2-2.3.3/bsd -DHAVE_CONFIG_H -c fsmeter.cc -o fsmeter.o
--- cmeterlib ---
--- cintratemeter.o ---
c++ -O2 -I/usr/pkg/include -I/usr/X11R7/include -I/usr/include -I/usr/pkg/include/freetype2 -DPNG_NO_ASSEMBLER_CODE -I/usr/pkg/include -I/usr/X11R7/include -I/usr/include -I/usr/pkg/include/freetype2 -I/usr/X11R7/include -I/tmp/pkgbuild/sysutils/xosview2/work.aarch64eb/xosview2-2.3.3 -I/tmp/pkgbuild/sysutils/xosview2/work.aarch64eb/xosview2-2.3.3/cmeter -I/tmp/pkgbuild/sysutils/xosview2/work.aarch64eb/xosview2-2.3.3/bsd -DHAVE_CONFIG_H -c cintratemeter.cc -o cintratemeter.o
--- meterlib ---
--- sensor.o ---
c++ -O2 -I/usr/pkg/include -I/usr/X11R7/include -I/usr/include -I/usr/pkg/include/freetype2 -DPNG_NO_ASSEMBLER_CODE -I/usr/pkg/include -I/usr/X11R7/include -I/usr/include -I/usr/pkg/include/freetype2 -I/usr/X11R7/include -I/tmp/pkgbuild/sysutils/xosview2/work.aarch64eb/xosview2-2.3.3 -I/tmp/pkgbuild/sysutils/xosview2/work.aarch64eb/xosview2-2.3.3/cmeter -I/tmp/pkgbuild/sysutils/xosview2/work.aarch64eb/xosview2-2.3.3/bsd -DHAVE_CONFIG_H -c sensor.cc -o sensor.o
--- strutil.o ---
c++ -O2 -I/usr/pkg/include -I/usr/X11R7/include -I/usr/include -I/usr/pkg/include/freetype2 -DPNG_NO_ASSEMBLER_CODE -I/usr/pkg/include -I/usr/X11R7/include -I/usr/include -I/usr/pkg/include/freetype2 -I/usr/X11R7/include -I/tmp/pkgbuild/sysutils/xosview2/work.aarch64eb/xosview2-2.3.3 -I/tmp/pkgbuild/sysutils/xosview2/work.aarch64eb/xosview2-2.3.3/cmeter -I/tmp/pkgbuild/sysutils/xosview2/work.aarch64eb/xosview2-2.3.3/bsd -DHAVE_CONFIG_H -c strutil.cc -o strutil.o
--- cmeterlib ---
--- pintratemeter.o ---
c++ -O2 -I/usr/pkg/include -I/usr/X11R7/include -I/usr/include -I/usr/pkg/include/freetype2 -DPNG_NO_ASSEMBLER_CODE -I/usr/pkg/include -I/usr/X11R7/include -I/usr/include -I/usr/pkg/include/freetype2 -I/usr/X11R7/include -I/tmp/pkgbuild/sysutils/xosview2/work.aarch64eb/xosview2-2.3.3 -I/tmp/pkgbuild/sysutils/xosview2/work.aarch64eb/xosview2-2.3.3/cmeter -I/tmp/pkgbuild/sysutils/xosview2/work.aarch64eb/xosview2-2.3.3/bsd -DHAVE_CONFIG_H -c pintratemeter.cc -o pintratemeter.o
--- meterlib ---
--- coretemp.o ---
c++ -O2 -I/usr/pkg/include -I/usr/X11R7/include -I/usr/include -I/usr/pkg/include/freetype2 -DPNG_NO_ASSEMBLER_CODE -I/usr/pkg/include -I/usr/X11R7/include -I/usr/include -I/usr/pkg/include/freetype2 -I/usr/X11R7/include -I/tmp/pkgbuild/sysutils/xosview2/work.aarch64eb/xosview2-2.3.3 -I/tmp/pkgbuild/sysutils/xosview2/work.aarch64eb/xosview2-2.3.3/cmeter -I/tmp/pkgbuild/sysutils/xosview2/work.aarch64eb/xosview2-2.3.3/bsd -DHAVE_CONFIG_H -c coretemp.cc -o coretemp.o
--- cmeterlib ---
--- cfsmeter.o ---
c++ -O2 -I/usr/pkg/include -I/usr/X11R7/include -I/usr/include -I/usr/pkg/include/freetype2 -DPNG_NO_ASSEMBLER_CODE -I/usr/pkg/include -I/usr/X11R7/include -I/usr/include -I/usr/pkg/include/freetype2 -I/usr/X11R7/include -I/tmp/pkgbuild/sysutils/xosview2/work.aarch64eb/xosview2-2.3.3 -I/tmp/pkgbuild/sysutils/xosview2/work.aarch64eb/xosview2-2.3.3/cmeter -I/tmp/pkgbuild/sysutils/xosview2/work.aarch64eb/xosview2-2.3.3/bsd -DHAVE_CONFIG_H -c cfsmeter.cc -o cfsmeter.o
--- fsutil.o ---
c++ -O2 -I/usr/pkg/include -I/usr/X11R7/include -I/usr/include -I/usr/pkg/include/freetype2 -DPNG_NO_ASSEMBLER_CODE -I/usr/pkg/include -I/usr/X11R7/include -I/usr/include -I/usr/pkg/include/freetype2 -I/usr/X11R7/include -I/tmp/pkgbuild/sysutils/xosview2/work.aarch64eb/xosview2-2.3.3 -I/tmp/pkgbuild/sysutils/xosview2/work.aarch64eb/xosview2-2.3.3/cmeter -I/tmp/pkgbuild/sysutils/xosview2/work.aarch64eb/xosview2-2.3.3/bsd -DHAVE_CONFIG_H -c fsutil.cc -o fsutil.o
--- meterlib ---
distcc[24906] ERROR: compile coretemp.cc on 10.0.20.122:3760 failed
distcc[24906] (dcc_build_somewhere) Warning: remote compilation of 'coretemp.cc' failed, retrying locally
distcc[24906] Warning: failed to distribute coretemp.cc to 10.0.20.122:3760, running locally instead
--- cmeterlib ---
--- cnetmeter.o ---
c++ -O2 -I/usr/pkg/include -I/usr/X11R7/include -I/usr/include -I/usr/pkg/include/freetype2 -DPNG_NO_ASSEMBLER_CODE -I/usr/pkg/include -I/usr/X11R7/include -I/usr/include -I/usr/pkg/include/freetype2 -I/usr/X11R7/include -I/tmp/pkgbuild/sysutils/xosview2/work.aarch64eb/xosview2-2.3.3 -I/tmp/pkgbuild/sysutils/xosview2/work.aarch64eb/xosview2-2.3.3/cmeter -I/tmp/pkgbuild/sysutils/xosview2/work.aarch64eb/xosview2-2.3.3/bsd -DHAVE_CONFIG_H -c cnetmeter.cc -o cnetmeter.o
--- glob.o ---
c++ -O2 -I/usr/pkg/include -I/usr/X11R7/include -I/usr/include -I/usr/pkg/include/freetype2 -DPNG_NO_ASSEMBLER_CODE -I/usr/pkg/include -I/usr/X11R7/include -I/usr/include -I/usr/pkg/include/freetype2 -I/usr/X11R7/include -I/tmp/pkgbuild/sysutils/xosview2/work.aarch64eb/xosview2-2.3.3 -I/tmp/pkgbuild/sysutils/xosview2/work.aarch64eb/xosview2-2.3.3/cmeter -I/tmp/pkgbuild/sysutils/xosview2/work.aarch64eb/xosview2-2.3.3/bsd -DHAVE_CONFIG_H -c glob.cc -o glob.o
--- cmeterlib ---
cnetmeter.cc: In member function 'virtual void ComNetMeter::checkevent()':
cnetmeter.cc:28:33: note: parameter passing for argument of type 'std::pair<float, float>' when C++17 is enabled changed to match C++14 in GCC 10.1
--- pnetmeter.o ---
c++ -O2 -I/usr/pkg/include -I/usr/X11R7/include -I/usr/include -I/usr/pkg/include/freetype2 -DPNG_NO_ASSEMBLER_CODE -I/usr/pkg/include -I/usr/X11R7/include -I/usr/include -I/usr/pkg/include/freetype2 -I/usr/X11R7/include -I/tmp/pkgbuild/sysutils/xosview2/work.aarch64eb/xosview2-2.3.3 -I/tmp/pkgbuild/sysutils/xosview2/work.aarch64eb/xosview2-2.3.3/cmeter -I/tmp/pkgbuild/sysutils/xosview2/work.aarch64eb/xosview2-2.3.3/bsd -DHAVE_CONFIG_H -c pnetmeter.cc -o pnetmeter.o
--- log.o ---
c++ -O2 -I/usr/pkg/include -I/usr/X11R7/include -I/usr/include -I/usr/pkg/include/freetype2 -DPNG_NO_ASSEMBLER_CODE -I/usr/pkg/include -I/usr/X11R7/include -I/usr/include -I/usr/pkg/include/freetype2 -I/usr/X11R7/include -I/tmp/pkgbuild/sysutils/xosview2/work.aarch64eb/xosview2-2.3.3 -I/tmp/pkgbuild/sysutils/xosview2/work.aarch64eb/xosview2-2.3.3/cmeter -I/tmp/pkgbuild/sysutils/xosview2/work.aarch64eb/xosview2-2.3.3/bsd -DHAVE_CONFIG_H -c log.cc -o log.o
--- meterlib ---
coretemp.cc: In member function 'virtual void CoreTemp::checkResources(const ResDB&)':
coretemp.cc:50:5: error: 'BSDGetCPUTemperature' was not declared in this scope
   50 |     BSDGetCPUTemperature(_temps, tjmax);
      |     ^~~~~~~~~~~~~~~~~~~~
coretemp.cc: In static member function 'static unsigned int CoreTemp::countCpus()':
coretemp.cc:75:12: error: 'BSDGetCPUTemperature' was not declared in this scope
   75 |     return BSDGetCPUTemperature();
      |            ^~~~~~~~~~~~~~~~~~~~
coretemp.cc: In member function 'void CoreTemp::getcoretemp()':
coretemp.cc:107:5: error: 'BSDGetCPUTemperature' was not declared in this scope
  107 |     BSDGetCPUTemperature(_temps);
      |     ^~~~~~~~~~~~~~~~~~~~
--- xftfont.o ---
--- meterlib ---
distcc[24906] ERROR: compile coretemp.cc on localhost failed
--- xftfont.o ---
c++ -O2 -I/usr/pkg/include -I/usr/X11R7/include -I/usr/include -I/usr/pkg/include/freetype2 -DPNG_NO_ASSEMBLER_CODE -I/usr/pkg/include -I/usr/X11R7/include -I/usr/include -I/usr/pkg/include/freetype2 -I/usr/X11R7/include -I/tmp/pkgbuild/sysutils/xosview2/work.aarch64eb/xosview2-2.3.3 -I/tmp/pkgbuild/sysutils/xosview2/work.aarch64eb/xosview2-2.3.3/cmeter -I/tmp/pkgbuild/sysutils/xosview2/work.aarch64eb/xosview2-2.3.3/bsd -DHAVE_CONFIG_H -c xftfont.cc -o xftfont.o
--- meterlib ---
*** [coretemp.o] Error code 1

make[1]: stopped in /tmp/pkgbuild/sysutils/xosview2/work.aarch64eb/xosview2-2.3.3/bsd
1 error

make[1]: stopped in /tmp/pkgbuild/sysutils/xosview2/work.aarch64eb/xosview2-2.3.3/bsd
--- cmeterlib ---
*** [cmeterlib] Error code 6

make: stopped in /tmp/pkgbuild/sysutils/xosview2/work.aarch64eb/xosview2-2.3.3
--- meterlib ---
*** [meterlib] Error code 2

make: stopped in /tmp/pkgbuild/sysutils/xosview2/work.aarch64eb/xosview2-2.3.3
2 errors

make: stopped in /tmp/pkgbuild/sysutils/xosview2/work.aarch64eb/xosview2-2.3.3
*** Error code 2

Stop.
make[1]: stopped in /usr/pkgsrc/sysutils/xosview2
*** Error code 1

Stop.
make: stopped in /usr/pkgsrc/sysutils/xosview2