=> Bootstrap dependency digest>=20211023: found digest-20220214
===> Skipping vulnerability checks.
WARNING: No /usr/pkg/pkgdb/pkg-vulnerabilities file found.
WARNING: To fix run: `/usr/sbin/pkg_admin -K /usr/pkg/pkgdb fetch-pkg-vulnerabilities'.
===> Building for ser-0.8.14nb5
Makefile.defs:523: You are using an old and unsupported gcc version (gcc), compile at your own risk!
yacc -d -b cfg cfg.y
yacc: 1 shift/reduce conflict.
yacc -d -b cfg cfg.y
yacc: 1 shift/reduce conflict.
flex cfg.lex
Makefile.defs:523: You are using an old and unsupported gcc version (gcc), compile at your own risk!
gcc -g -O9 -funroll-loops   -Wall  -mv8     -DNAME='""' -DVERSION='"0.8.14"' -DARCH='"sparc64"' -DOS='"netbsd"' -DCOMPILER='"gcc gcc (nb3 20231008) 10.5.0"' -D__CPU_sparc64 -D__OS_netbsd -DCFG_DIR='"/usr/pkg/etc/ser/"' -DPKG_MALLOC -DSHM_MEM  -DSHM_MMAP -DDNS_IP_HACK -DUSE_IPV6 -DUSE_TCP -DDISABLE_NAGLE -DF_MALLOC  -DFAST_LOCK -DADAPTIVE_WAIT -DADAPTIVE_WAIT_LOOPS=1024  -DHAVE_SOCKADDR_SA_LEN -DHAVE_GETHOSTBYNAME2 -DHAVE_MSGHDR_MSG_CONTROL -c action.c -o action.o
gcc -g -O9 -funroll-loops   -Wall  -mv8     -DNAME='""' -DVERSION='"0.8.14"' -DARCH='"sparc64"' -DOS='"netbsd"' -DCOMPILER='"gcc gcc (nb3 20231008) 10.5.0"' -D__CPU_sparc64 -D__OS_netbsd -DCFG_DIR='"/usr/pkg/etc/ser/"' -DPKG_MALLOC -DSHM_MEM  -DSHM_MMAP -DDNS_IP_HACK -DUSE_IPV6 -DUSE_TCP -DDISABLE_NAGLE -DF_MALLOC  -DFAST_LOCK -DADAPTIVE_WAIT -DADAPTIVE_WAIT_LOOPS=1024  -DHAVE_SOCKADDR_SA_LEN -DHAVE_GETHOSTBYNAME2 -DHAVE_MSGHDR_MSG_CONTROL -c crc.c -o crc.o
gcc -g -O9 -funroll-loops   -Wall  -mv8     -DNAME='""' -DVERSION='"0.8.14"' -DARCH='"sparc64"' -DOS='"netbsd"' -DCOMPILER='"gcc gcc (nb3 20231008) 10.5.0"' -D__CPU_sparc64 -D__OS_netbsd -DCFG_DIR='"/usr/pkg/etc/ser/"' -DPKG_MALLOC -DSHM_MEM  -DSHM_MMAP -DDNS_IP_HACK -DUSE_IPV6 -DUSE_TCP -DDISABLE_NAGLE -DF_MALLOC  -DFAST_LOCK -DADAPTIVE_WAIT -DADAPTIVE_WAIT_LOOPS=1024  -DHAVE_SOCKADDR_SA_LEN -DHAVE_GETHOSTBYNAME2 -DHAVE_MSGHDR_MSG_CONTROL -c data_lump.c -o data_lump.o
gcc: error: unrecognized command-line option '-mv8'
distcc[11352] ERROR: compile action.c on 10.0.20.122:3742 failed
distcc[11352] (dcc_build_somewhere) Warning: remote compilation of 'action.c' failed, retrying locally
distcc[11352] Warning: failed to distribute action.c to 10.0.20.122:3742, running locally instead
gcc: error: unrecognized command-line option '-mv8'
distcc[7842] ERROR: compile data_lump.c on 10.0.20.122:3742 failed
distcc[7842] (dcc_build_somewhere) Warning: remote compilation of 'data_lump.c' failed, retrying locally
distcc[7842] Warning: failed to distribute data_lump.c to 10.0.20.122:3742, running locally instead
gcc: error: unrecognized command-line option '-mv8'
distcc[19274] ERROR: compile crc.c on 10.0.20.122:3742 failed
distcc[19274] (dcc_build_somewhere) Warning: remote compilation of 'crc.c' failed, retrying locally
distcc[19274] Warning: failed to distribute crc.c to 10.0.20.122:3742, running locally instead
gcc: error: unrecognized command-line option '-mv8'
distcc[11352] ERROR: compile action.c on localhost failed
gcc: error: unrecognized command-line option '-mv8'
gmake: *** [Makefile.rules:18: action.o] Error 1
gmake: *** Waiting for unfinished jobs....
distcc[7842] ERROR: compile data_lump.c on localhost failed
gmake: *** [Makefile.rules:18: data_lump.o] Error 1
gcc: error: unrecognized command-line option '-mv8'
distcc[19274] ERROR: compile crc.c on localhost failed
gmake: *** [Makefile.rules:18: crc.o] Error 1
*** Error code 2

Stop.
make[1]: stopped in /usr/pkgsrc/net/ser
*** Error code 1

Stop.
make: stopped in /usr/pkgsrc/net/ser