=> Bootstrap dependency digest>=20211023: found digest-20220214
===> Skipping vulnerability checks.
WARNING: No /usr/pkg/pkgdb/pkg-vulnerabilities file found.
WARNING: To fix run: `/usr/sbin/pkg_admin -K /usr/pkg/pkgdb fetch-pkg-vulnerabilities'.
===> Building for elementary-1.7.10nb7
CDPATH="${ZSH_VERSION+.}:" && cd . && aclocal -I m4
sh: svnversion: not found
 cd . && automake -af --gnu
sh: svnversion: not found
configure.ac:700: warning: The 'AM_PROG_MKDIR_P' macro is deprecated, and its use is discouraged.
configure.ac:700: You should use the Autoconf-provided 'AC_PROG_MKDIR_P' macro instead,
configure.ac:700: and use '$(MKDIR_P)' instead of '$(mkdir_p)'in your Makefile.am files.
configure.ac:41: installing './compile'
config/Makefile.am:12: warning: '%'-style pattern rules are a GNU make extension
config/default/Makefile.am:16: warning: '%'-style pattern rules are a GNU make extension
config/mobile/Makefile.am:16: warning: '%'-style pattern rules are a GNU make extension
config/standard/Makefile.am:16: warning: '%'-style pattern rules are a GNU make extension
doc/Makefile.am:221: warning: wildcard img/*.*: non-POSIX variable name
doc/Makefile.am:221: (probably a GNU make extension)
CDPATH="${ZSH_VERSION+.}:" && cd . && /bin/sh /tmp/pkgbuild/x11/elementary/work.sparc/elementary-1.7.10/missing autoconf
sh: svnversion: not found
configure.ac:41: warning: The macro `AC_GNU_SOURCE' is obsolete.
configure.ac:41: You should run autoupdate.
./lib/autoconf/specific.m4:312: AC_GNU_SOURCE is expanded from...
configure.ac:41: the top level
configure.ac:44: warning: The macro `AC_ISC_POSIX' is obsolete.
configure.ac:44: You should run autoupdate.
./lib/autoconf/specific.m4:550: AC_ISC_POSIX is expanded from...
configure.ac:44: the top level
configure.ac:46: warning: The macro `AC_PROG_CC_STDC' is obsolete.
configure.ac:46: You should run autoupdate.
./lib/autoconf/c.m4:1666: AC_PROG_CC_STDC is expanded from...
configure.ac:46: the top level
configure.ac:47: warning: The macro `AC_HEADER_STDC' is obsolete.
configure.ac:47: You should run autoupdate.
./lib/autoconf/headers.m4:704: AC_HEADER_STDC is expanded from...
configure.ac:47: the top level
configure.ac:49: warning: The macro `AC_TRY_COMPILE' is obsolete.
configure.ac:49: You should run autoupdate.
./lib/autoconf/general.m4:2847: AC_TRY_COMPILE is expanded from...
lib/m4sugar/m4sh.m4:692: _AS_IF_ELSE is expanded from...
lib/m4sugar/m4sh.m4:699: AS_IF is expanded from...
./lib/autoconf/general.m4:2249: AC_CACHE_VAL is expanded from...
m4/ac_attribute.m4:15: AC_C___ATTRIBUTE__ is expanded from...
configure.ac:49: the top level
configure.ac:52: warning: The macro `AC_LIBTOOL_WIN32_DLL' is obsolete.
configure.ac:52: You should run autoupdate.
m4/ltoptions.m4:146: AC_LIBTOOL_WIN32_DLL is expanded from...
configure.ac:52: the top level
configure.ac:52: warning: AC_LIBTOOL_WIN32_DLL: Remove this warning and the call to _LT_SET_OPTION when you
configure.ac:52: put the `win32-dll' option into LT_INIT's first parameter.
./lib/autoconf/general.m4:2434: AC_DIAGNOSE is expanded from...
m4/ltoptions.m4:146: AC_LIBTOOL_WIN32_DLL is expanded from...
configure.ac:52: the top level
configure.ac:55: warning: The macro `AC_PROG_LIBTOOL' is obsolete.
configure.ac:55: You should run autoupdate.
aclocal.m4:122: AC_PROG_LIBTOOL is expanded from...
configure.ac:55: the top level
configure.ac:199: warning: The macro `AC_HELP_STRING' is obsolete.
configure.ac:199: You should run autoupdate.
./lib/autoconf/general.m4:204: AC_HELP_STRING is expanded from...
./lib/autoconf/general.m4:1534: AC_ARG_ENABLE is expanded from...
configure.ac:199: the top level
configure.ac:272: warning: The macro `AC_HELP_STRING' is obsolete.
configure.ac:272: You should run autoupdate.
./lib/autoconf/general.m4:204: AC_HELP_STRING is expanded from...
./lib/autoconf/general.m4:1534: AC_ARG_ENABLE is expanded from...
configure.ac:272: the top level
configure.ac:291: warning: The macro `AC_HELP_STRING' is obsolete.
configure.ac:291: You should run autoupdate.
./lib/autoconf/general.m4:204: AC_HELP_STRING is expanded from...
./lib/autoconf/general.m4:1534: AC_ARG_ENABLE is expanded from...
configure.ac:291: the top level
configure.ac:315: warning: The macro `AC_HELP_STRING' is obsolete.
configure.ac:315: You should run autoupdate.
./lib/autoconf/general.m4:204: AC_HELP_STRING is expanded from...
./lib/autoconf/general.m4:1534: AC_ARG_ENABLE is expanded from...
configure.ac:315: the top level
configure.ac:338: warning: The macro `AC_HELP_STRING' is obsolete.
configure.ac:338: You should run autoupdate.
./lib/autoconf/general.m4:204: AC_HELP_STRING is expanded from...
./lib/autoconf/general.m4:1534: AC_ARG_ENABLE is expanded from...
configure.ac:338: the top level
configure.ac:361: warning: The macro `AC_HELP_STRING' is obsolete.
configure.ac:361: You should run autoupdate.
./lib/autoconf/general.m4:204: AC_HELP_STRING is expanded from...
./lib/autoconf/general.m4:1534: AC_ARG_ENABLE is expanded from...
configure.ac:361: the top level
configure.ac:384: warning: The macro `AC_HELP_STRING' is obsolete.
configure.ac:384: You should run autoupdate.
./lib/autoconf/general.m4:204: AC_HELP_STRING is expanded from...
./lib/autoconf/general.m4:1534: AC_ARG_ENABLE is expanded from...
configure.ac:384: the top level
configure.ac:407: warning: The macro `AC_HELP_STRING' is obsolete.
configure.ac:407: You should run autoupdate.
./lib/autoconf/general.m4:204: AC_HELP_STRING is expanded from...
./lib/autoconf/general.m4:1534: AC_ARG_ENABLE is expanded from...
configure.ac:407: the top level
configure.ac:430: warning: The macro `AC_HELP_STRING' is obsolete.
configure.ac:430: You should run autoupdate.
./lib/autoconf/general.m4:204: AC_HELP_STRING is expanded from...
./lib/autoconf/general.m4:1534: AC_ARG_ENABLE is expanded from...
configure.ac:430: the top level
configure.ac:453: warning: The macro `AC_HELP_STRING' is obsolete.
configure.ac:453: You should run autoupdate.
./lib/autoconf/general.m4:204: AC_HELP_STRING is expanded from...
./lib/autoconf/general.m4:1534: AC_ARG_ENABLE is expanded from...
configure.ac:453: the top level
configure.ac:477: warning: The macro `AC_HELP_STRING' is obsolete.
configure.ac:477: You should run autoupdate.
./lib/autoconf/general.m4:204: AC_HELP_STRING is expanded from...
./lib/autoconf/general.m4:1534: AC_ARG_ENABLE is expanded from...
configure.ac:477: the top level
configure.ac:505: warning: The macro `AC_HELP_STRING' is obsolete.
configure.ac:505: You should run autoupdate.
./lib/autoconf/general.m4:204: AC_HELP_STRING is expanded from...
./lib/autoconf/general.m4:1534: AC_ARG_ENABLE is expanded from...
configure.ac:505: the top level
configure.ac:535: warning: The macro `AC_HELP_STRING' is obsolete.
configure.ac:535: You should run autoupdate.
./lib/autoconf/general.m4:204: AC_HELP_STRING is expanded from...
./lib/autoconf/general.m4:1534: AC_ARG_ENABLE is expanded from...
configure.ac:535: the top level
configure.ac:563: warning: The macro `AC_HELP_STRING' is obsolete.
configure.ac:563: You should run autoupdate.
./lib/autoconf/general.m4:204: AC_HELP_STRING is expanded from...
./lib/autoconf/general.m4:1534: AC_ARG_ENABLE is expanded from...
configure.ac:563: the top level
configure.ac:593: warning: The macro `AC_HELP_STRING' is obsolete.
configure.ac:593: You should run autoupdate.
./lib/autoconf/general.m4:204: AC_HELP_STRING is expanded from...
./lib/autoconf/general.m4:1534: AC_ARG_ENABLE is expanded from...
configure.ac:593: the top level
configure.ac:621: warning: The macro `AC_HELP_STRING' is obsolete.
configure.ac:621: You should run autoupdate.
./lib/autoconf/general.m4:204: AC_HELP_STRING is expanded from...
./lib/autoconf/general.m4:1534: AC_ARG_ENABLE is expanded from...
configure.ac:621: the top level
configure.ac:655: warning: The macro `AC_HELP_STRING' is obsolete.
configure.ac:655: You should run autoupdate.
./lib/autoconf/general.m4:204: AC_HELP_STRING is expanded from...
./lib/autoconf/general.m4:1534: AC_ARG_ENABLE is expanded from...
configure.ac:655: the top level
configure.ac:688: warning: The macro `AC_HELP_STRING' is obsolete.
configure.ac:688: You should run autoupdate.
./lib/autoconf/general.m4:204: AC_HELP_STRING is expanded from...
./lib/autoconf/general.m4:1553: AC_ARG_WITH is expanded from...
m4/efl_binary.m4:52: EFL_WITH_BIN is expanded from...
configure.ac:688: the top level
configure.ac:689: warning: The macro `AC_HELP_STRING' is obsolete.
configure.ac:689: You should run autoupdate.
./lib/autoconf/general.m4:204: AC_HELP_STRING is expanded from...
./lib/autoconf/general.m4:1553: AC_ARG_WITH is expanded from...
m4/efl_binary.m4:52: EFL_WITH_BIN is expanded from...
configure.ac:689: the top level
configure.ac:691: warning: The macro `AC_HELP_STRING' is obsolete.
configure.ac:691: You should run autoupdate.
./lib/autoconf/general.m4:204: AC_HELP_STRING is expanded from...
./lib/autoconf/general.m4:1534: AC_ARG_ENABLE is expanded from...
m4/efl_doxygen.m4:11: EFL_CHECK_DOXYGEN is expanded from...
configure.ac:691: the top level
configure.ac:691: warning: The macro `AC_HELP_STRING' is obsolete.
configure.ac:691: You should run autoupdate.
./lib/autoconf/general.m4:204: AC_HELP_STRING is expanded from...
./lib/autoconf/general.m4:1553: AC_ARG_WITH is expanded from...
m4/efl_doxygen.m4:11: EFL_CHECK_DOXYGEN is expanded from...
configure.ac:691: the top level
configure.ac:693: warning: The macro `AC_HELP_STRING' is obsolete.
configure.ac:693: You should run autoupdate.
./lib/autoconf/general.m4:204: AC_HELP_STRING is expanded from...
./lib/autoconf/general.m4:1534: AC_ARG_ENABLE is expanded from...
m4/efl_binary.m4:11: EFL_ENABLE_BIN is expanded from...
configure.ac:693: the top level
configure.ac:694: warning: The macro `AC_HELP_STRING' is obsolete.
configure.ac:694: You should run autoupdate.
./lib/autoconf/general.m4:204: AC_HELP_STRING is expanded from...
./lib/autoconf/general.m4:1534: AC_ARG_ENABLE is expanded from...
m4/efl_binary.m4:11: EFL_ENABLE_BIN is expanded from...
configure.ac:694: the top level
configure.ac:700: warning: AM_PROG_MKDIR_P: this macro is deprecated, and will soon be removed.
configure.ac:700: You should use the Autoconf-provided 'AC_PROG_MKDIR_P' macro instead,
configure.ac:700: and use '$(MKDIR_P)' instead of '$(mkdir_p)'in your Makefile.am files.
./lib/autoconf/general.m4:2434: AC_DIAGNOSE is expanded from...
aclocal.m4:9467: AM_PROG_MKDIR_P is expanded from...
m4/po.m4:23: AM_PO_SUBDIRS is expanded from...
m4/gettext.m4:57: AM_GNU_GETTEXT is expanded from...
configure.ac:700: the top level
configure.ac:700: warning: The macro `AC_TRY_LINK' is obsolete.
configure.ac:700: You should run autoupdate.
./lib/autoconf/general.m4:2920: AC_TRY_LINK is expanded from...
lib/m4sugar/m4sh.m4:692: _AS_IF_ELSE is expanded from...
lib/m4sugar/m4sh.m4:699: AS_IF is expanded from...
./lib/autoconf/general.m4:2249: AC_CACHE_VAL is expanded from...
./lib/autoconf/general.m4:2270: AC_CACHE_CHECK is expanded from...
m4/intlmacosx.m4:18: gt_INTL_MACOSX is expanded from...
m4/gettext.m4:57: AM_GNU_GETTEXT is expanded from...
configure.ac:700: the top level
configure.ac:700: warning: The macro `AC_TRY_LINK' is obsolete.
configure.ac:700: You should run autoupdate.
./lib/autoconf/general.m4:2920: AC_TRY_LINK is expanded from...
lib/m4sugar/m4sh.m4:692: _AS_IF_ELSE is expanded from...
lib/m4sugar/m4sh.m4:699: AS_IF is expanded from...
./lib/autoconf/general.m4:2249: AC_CACHE_VAL is expanded from...
./lib/autoconf/general.m4:2270: AC_CACHE_CHECK is expanded from...
m4/gettext.m4:57: AM_GNU_GETTEXT is expanded from...
configure.ac:700: the top level
configure.ac:700: warning: The macro `AC_TRY_LINK' is obsolete.
configure.ac:700: You should run autoupdate.
./lib/autoconf/general.m4:2920: AC_TRY_LINK is expanded from...
lib/m4sugar/m4sh.m4:692: _AS_IF_ELSE is expanded from...
lib/m4sugar/m4sh.m4:699: AS_IF is expanded from...
./lib/autoconf/general.m4:2249: AC_CACHE_VAL is expanded from...
./lib/autoconf/general.m4:2270: AC_CACHE_CHECK is expanded from...
m4/iconv.m4:20: AM_ICONV_LINK is expanded from...
m4/gettext.m4:57: AM_GNU_GETTEXT is expanded from...
configure.ac:700: the top level
configure.ac:700: warning: The macro `AC_TRY_RUN' is obsolete.
configure.ac:700: You should run autoupdate.
./lib/autoconf/general.m4:2997: AC_TRY_RUN is expanded from...
lib/m4sugar/m4sh.m4:692: _AS_IF_ELSE is expanded from...
lib/m4sugar/m4sh.m4:699: AS_IF is expanded from...
./lib/autoconf/general.m4:2249: AC_CACHE_VAL is expanded from...
./lib/autoconf/general.m4:2270: AC_CACHE_CHECK is expanded from...
m4/iconv.m4:20: AM_ICONV_LINK is expanded from...
m4/gettext.m4:57: AM_GNU_GETTEXT is expanded from...
configure.ac:700: the top level
configure.ac:718: warning: The macro `AC_HELP_STRING' is obsolete.
configure.ac:718: You should run autoupdate.
./lib/autoconf/general.m4:204: AC_HELP_STRING is expanded from...
./lib/autoconf/general.m4:1553: AC_ARG_WITH is expanded from...
configure.ac:718: the top level
configure.ac:727: warning: The macro `AC_HELP_STRING' is obsolete.
configure.ac:727: You should run autoupdate.
./lib/autoconf/general.m4:204: AC_HELP_STRING is expanded from...
./lib/autoconf/general.m4:1534: AC_ARG_ENABLE is expanded from...
m4/efl_examples.m4:9: EFL_CHECK_BUILD_EXAMPLES is expanded from...
configure.ac:727: the top level
configure.ac:728: warning: The macro `AC_HELP_STRING' is obsolete.
configure.ac:728: You should run autoupdate.
./lib/autoconf/general.m4:204: AC_HELP_STRING is expanded from...
./lib/autoconf/general.m4:1534: AC_ARG_ENABLE is expanded from...
m4/efl_examples.m4:39: EFL_CHECK_INSTALL_EXAMPLES is expanded from...
configure.ac:728: the top level
configure.ac:730: warning: The macro `AC_TRY_LINK' is obsolete.
configure.ac:730: You should run autoupdate.
./lib/autoconf/general.m4:2920: AC_TRY_LINK is expanded from...
configure.ac:730: the top level
configure.ac:739: warning: The macro `AC_TRY_LINK' is obsolete.
configure.ac:739: You should run autoupdate.
./lib/autoconf/general.m4:2920: AC_TRY_LINK is expanded from...
configure.ac:739: the top level
configure.ac:747: warning: AC_OUTPUT should be used without arguments.
configure.ac:747: You should run autoupdate.
/bin/sh ./config.status --recheck
 cd . && /bin/sh ./config.status Makefile 
config.status: creating Makefile
/bin/sh ./config.status --recheck
(CDPATH="${ZSH_VERSION+.}:" && cd . && /bin/sh /tmp/pkgbuild/x11/elementary/work.sparc/elementary-1.7.10/missing autoheader)
rm -f stamp-h1
touch elementary_config.h.in
cd . && /bin/sh ./config.status elementary_config.h
config.status: creating elementary_config.h
/usr/pkg/bin/gmake  all-recursive
gmake[1]: Entering directory '/tmp/pkgbuild/x11/elementary/work.sparc/elementary-1.7.10'
/bin/sh ./config.status --recheck
Making all in src
gmake[2]: Entering directory '/tmp/pkgbuild/x11/elementary/work.sparc/elementary-1.7.10/src'
cd .. && /usr/pkg/bin/gmake  am--refresh
gmake[3]: Entering directory '/tmp/pkgbuild/x11/elementary/work.sparc/elementary-1.7.10'
/bin/sh ./config.status --recheck
gmake[3]: Leaving directory '/tmp/pkgbuild/x11/elementary/work.sparc/elementary-1.7.10'
 cd .. && /bin/sh ./config.status src/Makefile 
config.status: creating src/Makefile
cd .. && /usr/pkg/bin/gmake  am--refresh
gmake[3]: Entering directory '/tmp/pkgbuild/x11/elementary/work.sparc/elementary-1.7.10'
/bin/sh ./config.status --recheck
gmake[3]: Leaving directory '/tmp/pkgbuild/x11/elementary/work.sparc/elementary-1.7.10'
Making all in lib
gmake[3]: Entering directory '/tmp/pkgbuild/x11/elementary/work.sparc/elementary-1.7.10/src/lib'
cd ../.. && /usr/pkg/bin/gmake  am--refresh
gmake[4]: Entering directory '/tmp/pkgbuild/x11/elementary/work.sparc/elementary-1.7.10'
/bin/sh ./config.status --recheck
gmake[4]: Leaving directory '/tmp/pkgbuild/x11/elementary/work.sparc/elementary-1.7.10'
 cd ../.. && /bin/sh ./config.status src/lib/Makefile depfiles
config.status: creating src/lib/Makefile
config.status: executing depfiles commands
cd ../.. && /usr/pkg/bin/gmake  am--refresh
gmake[4]: Entering directory '/tmp/pkgbuild/x11/elementary/work.sparc/elementary-1.7.10'
/bin/sh ./config.status --recheck
gmake[4]: Leaving directory '/tmp/pkgbuild/x11/elementary/work.sparc/elementary-1.7.10'
  CC       libelementary_la-elc_ctxpopup.lo
  CC       libelementary_la-elc_fileselector.lo
  CC       libelementary_la-elc_fileselector_button.lo
  CC       libelementary_la-elc_fileselector_entry.lo
  CC       libelementary_la-elc_hoversel.lo
  CC       libelementary_la-elc_multibuttonentry.lo
  CC       libelementary_la-elc_naviframe.lo
  CC       libelementary_la-elc_player.lo
  CC       libelementary_la-elc_popup.lo
  CC       libelementary_la-elc_scrolled_entry.lo
  CC       libelementary_la-elm_access.lo
  CC       libelementary_la-elm_actionslider.lo
  CC       libelementary_la-elm_bg.lo
  CC       libelementary_la-elm_box.lo
  CC       libelementary_la-elm_bubble.lo
  CC       libelementary_la-elm_button.lo
  CC       libelementary_la-elm_calendar.lo
  CC       libelementary_la-elm_check.lo
  CC       libelementary_la-elm_clock.lo
  CC       libelementary_la-elm_cnp.lo
  CC       libelementary_la-elm_colorselector.lo
  CC       libelementary_la-elm_config.lo
  CC       libelementary_la-elm_conform.lo
  CC       libelementary_la-elm_container.lo
  CC       libelementary_la-elm_datetime.lo
  CC       libelementary_la-elm_dayselector.lo
  CC       libelementary_la-elm_diskselector.lo
  CC       libelementary_la-elm_entry.lo
  CC       libelementary_la-elm_flip.lo
  CC       libelementary_la-elm_flipselector.lo
  CC       libelementary_la-elm_font.lo
  CC       libelementary_la-elm_frame.lo
  CC       libelementary_la-elm_gengrid.lo
  CC       libelementary_la-elm_genlist.lo
  CC       libelementary_la-elm_gesture_layer.lo
elm_gesture_layer.c: In function '_rotate_test':
elm_gesture_layer.c:3452:12: warning: this statement may fall through [-Wimplicit-fallthrough=]
elm_gesture_layer.c:3456:7: note: here
elm_gesture_layer.c: In function '_zoom_test':
elm_gesture_layer.c:3207:12: warning: this statement may fall through [-Wimplicit-fallthrough=]
elm_gesture_layer.c:3211:7: note: here
  CC       libelementary_la-elm_glview.lo
  CC       libelementary_la-elm_grid.lo
  CC       libelementary_la-elm_hover.lo
  CC       libelementary_la-elm_icon.lo
  CC       libelementary_la-elm_image.lo
  CC       libelementary_la-elm_index.lo
  CC       libelementary_la-elm_interface_scrollable.lo
elm_interface_scrollable.c:365:19: warning: 'SCROLL_SMART_NAME' defined but not used [-Wunused-const-variable=]
  CC       libelementary_la-elm_inwin.lo
  CC       libelementary_la-elm_label.lo
  CC       libelementary_la-elm_layout.lo
  CC       libelementary_la-elm_list.lo
  CC       libelementary_la-elm_main.lo
  CC       libelementary_la-elm_map.lo
  CC       libelementary_la-elm_mapbuf.lo
  CC       libelementary_la-elm_menu.lo
  CC       libelementary_la-elm_module.lo
  CC       libelementary_la-elm_notify.lo
  CC       libelementary_la-elm_panel.lo
  CC       libelementary_la-elm_panes.lo
  CC       libelementary_la-elm_photo.lo
  CC       libelementary_la-elm_photocam.lo
  CC       libelementary_la-elm_plug.lo
  CC       libelementary_la-elm_progressbar.lo
  CC       libelementary_la-elm_radio.lo
  CC       libelementary_la-elm_route.lo
  CC       libelementary_la-elm_scroller.lo
  CC       libelementary_la-elm_segment_control.lo
elm_segment_control.c: In function '_item_content_get_hook':
elm_segment_control.c:463:18: warning: argument 1 null where non-null expected [-Wnonnull]
In file included from ./Elementary.h:27:0,
                 from elm_segment_control.c:1:
/usr/include/string.h:56:5: note: in a call to function 'strcmp' declared here
 int  strcmp(const char *, const char *);
     ^~~~~~
  CC       libelementary_la-elm_separator.lo
  CC       libelementary_la-elm_slider.lo
  CC       libelementary_la-elm_slideshow.lo
  CC       libelementary_la-elm_spinner.lo
  CC       libelementary_la-elm_store.lo
  CC       libelementary_la-elm_table.lo
  CC       libelementary_la-elm_theme.lo
  CC       libelementary_la-elm_thumb.lo
  CC       libelementary_la-elm_toolbar.lo
elm_toolbar.c: In function 'elm_toolbar_horizontal_set':
elm_toolbar.c:2568:20: warning: logical not is only applied to the left hand side of comparison [-Wlogical-not-parentheses]
elm_toolbar.c:2568:8: note: add parentheses around left hand side expression to silence this warning
  CC       libelementary_la-elm_transit.lo
  CC       libelementary_la-elm_util.lo
  CC       libelementary_la-elm_video.lo
  CC       libelementary_la-elm_web.lo
  CC       libelementary_la-elm_widget.lo
  CC       libelementary_la-elm_win.lo
  CC       libelementary_la-els_box.lo
  CC       libelementary_la-els_cursor.lo
  CC       libelementary_la-els_pan.lo
  CC       libelementary_la-els_scroller.lo
  CC       libelementary_la-els_tooltip.lo
  CC       libelementary_la-elu_ews_wm.lo
  CCLD     libelementary.la
gmake[3]: Leaving directory '/tmp/pkgbuild/x11/elementary/work.sparc/elementary-1.7.10/src/lib'
Making all in bin
gmake[3]: Entering directory '/tmp/pkgbuild/x11/elementary/work.sparc/elementary-1.7.10/src/bin'
cd ../.. && /usr/pkg/bin/gmake  am--refresh
gmake[4]: Entering directory '/tmp/pkgbuild/x11/elementary/work.sparc/elementary-1.7.10'
/bin/sh ./config.status --recheck
gmake[4]: Leaving directory '/tmp/pkgbuild/x11/elementary/work.sparc/elementary-1.7.10'
 cd ../.. && /bin/sh ./config.status src/bin/Makefile depfiles
config.status: creating src/bin/Makefile
config.status: executing depfiles commands
cd ../.. && /usr/pkg/bin/gmake  am--refresh
gmake[4]: Entering directory '/tmp/pkgbuild/x11/elementary/work.sparc/elementary-1.7.10'
/bin/sh ./config.status --recheck
gmake[4]: Leaving directory '/tmp/pkgbuild/x11/elementary/work.sparc/elementary-1.7.10'
  CC       test.o
  CC       test_3d.o
  CC       test_actionslider.o
  CC       test_anim.o
  CC       test_bg.o
  CC       test_box.o
  CC       test_bubble.o
  CC       test_button.o
  CC       test_calendar.o
  CC       test_check.o
  CC       test_clock.o
  CC       test_cnp.o
  CC       test_colorselector.o
  CC       test_conform.o
  CC       test_ctxpopup.o
  CC       test_cursor.o
  CC       test_datetime.o
  CC       test_dayselector.o
  CC       test_diskselector.o
  CC       test_entry.o
  CC       test_entry_anchor.o
  CC       test_entry_anchor2.o
  CC       test_fileselector_button.o
  CC       test_fileselector.o
  CC       test_fileselector_entry.o
  CC       test_flip.o
  CC       test_flip_page.o
  CC       test_flipselector.o
  CC       test_floating.o
  CC       test_focus.o
  CC       test_focus2.o
  CC       test_focus3.o
  CC       test_gengrid.o
  CC       test_genlist.o
  CC       test_gesture_layer.o
  CC       test_gesture_layer2.o
  CC       test_gesture_layer3.o
  CC       test_glview_simple.o
  CC       test_glview.o
  CC       test_grid.o
  CC       test_hover.o
  CC       test_hoversel.o
  CC       test_icon.o
  CC       test_icon_desktops.o
  CC       test_icon_animated.o
  CC       test_image.o
  CC       test_index.o
  CC       test_inwin.o
  CC       test_label.o
  CC       test_launcher.o
  CC       test_layout.o
  CC       test_list.o
  CC       test_map.o
  CC       test_menu.o
  CC       test_multi.o
  CC       test_multibuttonentry.o
  CC       test_naviframe.o
  CC       test_naviframe_complex.o
  CC       test_notify.o
  CC       test_panel.o
  CC       test_panes.o
  CC       test_photo.o
  CC       test_photocam.o
  CC       test_popup.o
  CC       test_progressbar.o
  CC       test_radio.o
  CC       test_scaling.o
  CC       test_scroller.o
  CC       test_segment_control.o
  CC       test_separator.o
  CC       test_slider.o
  CC       test_slideshow.o
  CC       test_spinner.o
  CC       test_store.o
  CC       test_table.o
  CC       test_thumb.o
  CC       test_toolbar.o
  CC       test_tooltip.o
  CC       test_transit.o
  CC       test_video.o
  CC       test_weather.o
  CC       test_web.o
  CC       test_win_inline.o
  CC       test_win_socket.o
  CC       test_win_plug.o
  CC       test_win_state.o
  CC       test_eio.o
  CCLD     elementary_test
  CC       config.o
  CCLD     elementary_config
  CC       quicklaunch.o
  CCLD     elementary_quicklaunch
  CC       run.o
  CCLD     elementary_run
  CC       elementary_testql-test.o
  CC       elementary_testql-test_3d.o
  CC       elementary_testql-test_actionslider.o
  CC       elementary_testql-test_anim.o
  CC       elementary_testql-test_bg.o
  CC       elementary_testql-test_box.o
  CC       elementary_testql-test_bubble.o
  CC       elementary_testql-test_button.o
  CC       elementary_testql-test_calendar.o
  CC       elementary_testql-test_check.o
  CC       elementary_testql-test_clock.o
  CC       elementary_testql-test_cnp.o
  CC       elementary_testql-test_colorselector.o
  CC       elementary_testql-test_conform.o
  CC       elementary_testql-test_ctxpopup.o
  CC       elementary_testql-test_cursor.o
  CC       elementary_testql-test_datetime.o
  CC       elementary_testql-test_dayselector.o
  CC       elementary_testql-test_diskselector.o
  CC       elementary_testql-test_entry.o
  CC       elementary_testql-test_entry_anchor.o
  CC       elementary_testql-test_entry_anchor2.o
  CC       elementary_testql-test_fileselector_button.o
  CC       elementary_testql-test_fileselector.o
  CC       elementary_testql-test_fileselector_entry.o
  CC       elementary_testql-test_flip.o
  CC       elementary_testql-test_flip_page.o
  CC       elementary_testql-test_flipselector.o
  CC       elementary_testql-test_floating.o
  CC       elementary_testql-test_focus.o
  CC       elementary_testql-test_focus2.o
  CC       elementary_testql-test_focus3.o
  CC       elementary_testql-test_gengrid.o
  CC       elementary_testql-test_genlist.o
  CC       elementary_testql-test_gesture_layer.o
  CC       elementary_testql-test_gesture_layer2.o
  CC       elementary_testql-test_gesture_layer3.o
  CC       elementary_testql-test_glview_simple.o
  CC       elementary_testql-test_glview.o
  CC       elementary_testql-test_grid.o
  CC       elementary_testql-test_hover.o
  CC       elementary_testql-test_hoversel.o
  CC       elementary_testql-test_icon.o
  CC       elementary_testql-test_icon_desktops.o
  CC       elementary_testql-test_icon_animated.o
  CC       elementary_testql-test_image.o
  CC       elementary_testql-test_index.o
  CC       elementary_testql-test_inwin.o
  CC       elementary_testql-test_label.o
  CC       elementary_testql-test_launcher.o
  CC       elementary_testql-test_layout.o
  CC       elementary_testql-test_list.o
  CC       elementary_testql-test_map.o
  CC       elementary_testql-test_menu.o
  CC       elementary_testql-test_multi.o
  CC       elementary_testql-test_multibuttonentry.o
  CC       elementary_testql-test_naviframe.o
  CC       elementary_testql-test_naviframe_complex.o
  CC       elementary_testql-test_notify.o
  CC       elementary_testql-test_panel.o
  CC       elementary_testql-test_panes.o
  CC       elementary_testql-test_photo.o
  CC       elementary_testql-test_photocam.o
  CC       elementary_testql-test_popup.o
  CC       elementary_testql-test_progressbar.o
  CC       elementary_testql-test_radio.o
  CC       elementary_testql-test_scaling.o
  CC       elementary_testql-test_scroller.o
  CC       elementary_testql-test_segment_control.o
  CC       elementary_testql-test_separator.o
  CC       elementary_testql-test_slider.o
  CC       elementary_testql-test_slideshow.o
  CC       elementary_testql-test_spinner.o
  CC       elementary_testql-test_store.o
  CC       elementary_testql-test_table.o
  CC       elementary_testql-test_thumb.o
  CC       elementary_testql-test_toolbar.o
  CC       elementary_testql-test_tooltip.o
  CC       elementary_testql-test_transit.o
  CC       elementary_testql-test_video.o
  CC       elementary_testql-test_weather.o
  CC       elementary_testql-test_web.o
  CC       elementary_testql-test_win_inline.o
  CC       elementary_testql-test_win_socket.o
  CC       elementary_testql-test_win_plug.o
  CC       elementary_testql-test_win_state.o
  CC       elementary_testql-test_eio.o
  CCLD     elementary_testql
  CC       elementary_testql_la-test.lo
  CC       elementary_testql_la-test_3d.lo
  CC       elementary_testql_la-test_actionslider.lo
  CC       elementary_testql_la-test_anim.lo
  CC       elementary_testql_la-test_bg.lo
  CC       elementary_testql_la-test_box.lo
  CC       elementary_testql_la-test_bubble.lo
  CC       elementary_testql_la-test_button.lo
  CC       elementary_testql_la-test_calendar.lo
  CC       elementary_testql_la-test_check.lo
  CC       elementary_testql_la-test_clock.lo
  CC       elementary_testql_la-test_cnp.lo
  CC       elementary_testql_la-test_colorselector.lo
  CC       elementary_testql_la-test_conform.lo
  CC       elementary_testql_la-test_ctxpopup.lo
  CC       elementary_testql_la-test_cursor.lo
  CC       elementary_testql_la-test_datetime.lo
  CC       elementary_testql_la-test_dayselector.lo
  CC       elementary_testql_la-test_diskselector.lo
  CC       elementary_testql_la-test_entry.lo
  CC       elementary_testql_la-test_entry_anchor.lo
  CC       elementary_testql_la-test_entry_anchor2.lo
  CC       elementary_testql_la-test_fileselector_button.lo
  CC       elementary_testql_la-test_fileselector.lo
  CC       elementary_testql_la-test_fileselector_entry.lo
  CC       elementary_testql_la-test_flip.lo
  CC       elementary_testql_la-test_flip_page.lo
  CC       elementary_testql_la-test_flipselector.lo
  CC       elementary_testql_la-test_floating.lo
  CC       elementary_testql_la-test_focus.lo
  CC       elementary_testql_la-test_focus2.lo
  CC       elementary_testql_la-test_focus3.lo
  CC       elementary_testql_la-test_gengrid.lo
  CC       elementary_testql_la-test_genlist.lo
  CC       elementary_testql_la-test_gesture_layer.lo
  CC       elementary_testql_la-test_gesture_layer2.lo
  CC       elementary_testql_la-test_gesture_layer3.lo
  CC       elementary_testql_la-test_glview_simple.lo
  CC       elementary_testql_la-test_glview.lo
  CC       elementary_testql_la-test_grid.lo
  CC       elementary_testql_la-test_hover.lo
  CC       elementary_testql_la-test_hoversel.lo
  CC       elementary_testql_la-test_icon.lo
  CC       elementary_testql_la-test_icon_desktops.lo
  CC       elementary_testql_la-test_icon_animated.lo
  CC       elementary_testql_la-test_image.lo
  CC       elementary_testql_la-test_index.lo
  CC       elementary_testql_la-test_inwin.lo
  CC       elementary_testql_la-test_label.lo
  CC       elementary_testql_la-test_launcher.lo
  CC       elementary_testql_la-test_layout.lo
  CC       elementary_testql_la-test_list.lo
  CC       elementary_testql_la-test_map.lo
  CC       elementary_testql_la-test_menu.lo
  CC       elementary_testql_la-test_multi.lo
  CC       elementary_testql_la-test_multibuttonentry.lo
  CC       elementary_testql_la-test_naviframe.lo
  CC       elementary_testql_la-test_naviframe_complex.lo
  CC       elementary_testql_la-test_notify.lo
  CC       elementary_testql_la-test_panel.lo
  CC       elementary_testql_la-test_panes.lo
  CC       elementary_testql_la-test_photo.lo
  CC       elementary_testql_la-test_photocam.lo
  CC       elementary_testql_la-test_popup.lo
  CC       elementary_testql_la-test_progressbar.lo
  CC       elementary_testql_la-test_radio.lo
  CC       elementary_testql_la-test_scaling.lo
  CC       elementary_testql_la-test_scroller.lo
  CC       elementary_testql_la-test_segment_control.lo
  CC       elementary_testql_la-test_separator.lo
  CC       elementary_testql_la-test_slider.lo
  CC       elementary_testql_la-test_slideshow.lo
  CC       elementary_testql_la-test_spinner.lo
  CC       elementary_testql_la-test_store.lo
  CC       elementary_testql_la-test_table.lo
  CC       elementary_testql_la-test_thumb.lo
  CC       elementary_testql_la-test_toolbar.lo
  CC       elementary_testql_la-test_tooltip.lo
  CC       elementary_testql_la-test_transit.lo
  CC       elementary_testql_la-test_video.lo
  CC       elementary_testql_la-test_weather.lo
  CC       elementary_testql_la-test_web.lo
  CC       elementary_testql_la-test_win_inline.lo
  CC       elementary_testql_la-test_win_socket.lo
  CC       elementary_testql_la-test_win_plug.lo
  CC       elementary_testql_la-test_win_state.lo
  CC       elementary_testql_la-test_eio.lo
  CCLD     elementary_testql.la
gmake[3]: Leaving directory '/tmp/pkgbuild/x11/elementary/work.sparc/elementary-1.7.10/src/bin'
Making all in modules
gmake[3]: Entering directory '/tmp/pkgbuild/x11/elementary/work.sparc/elementary-1.7.10/src/modules'
cd ../.. && /usr/pkg/bin/gmake  am--refresh
gmake[4]: Entering directory '/tmp/pkgbuild/x11/elementary/work.sparc/elementary-1.7.10'
/bin/sh ./config.status --recheck
gmake[4]: Leaving directory '/tmp/pkgbuild/x11/elementary/work.sparc/elementary-1.7.10'
 cd ../.. && /bin/sh ./config.status src/modules/Makefile 
config.status: creating src/modules/Makefile
cd ../.. && /usr/pkg/bin/gmake  am--refresh
gmake[4]: Entering directory '/tmp/pkgbuild/x11/elementary/work.sparc/elementary-1.7.10'
/bin/sh ./config.status --recheck
gmake[4]: Leaving directory '/tmp/pkgbuild/x11/elementary/work.sparc/elementary-1.7.10'
Making all in test_entry
gmake[4]: Entering directory '/tmp/pkgbuild/x11/elementary/work.sparc/elementary-1.7.10/src/modules/test_entry'
cd ../../.. && /usr/pkg/bin/gmake  am--refresh
gmake[5]: Entering directory '/tmp/pkgbuild/x11/elementary/work.sparc/elementary-1.7.10'
/bin/sh ./config.status --recheck
gmake[5]: Leaving directory '/tmp/pkgbuild/x11/elementary/work.sparc/elementary-1.7.10'
 cd ../../.. && /bin/sh ./config.status src/modules/test_entry/Makefile depfiles
config.status: creating src/modules/test_entry/Makefile
config.status: executing depfiles commands
cd ../../.. && /usr/pkg/bin/gmake  am--refresh
gmake[5]: Entering directory '/tmp/pkgbuild/x11/elementary/work.sparc/elementary-1.7.10'
/bin/sh ./config.status --recheck
gmake[5]: Leaving directory '/tmp/pkgbuild/x11/elementary/work.sparc/elementary-1.7.10'
  CC       module_la-mod.lo
  CCLD     module.la
gmake[4]: Leaving directory '/tmp/pkgbuild/x11/elementary/work.sparc/elementary-1.7.10/src/modules/test_entry'
Making all in test_map
gmake[4]: Entering directory '/tmp/pkgbuild/x11/elementary/work.sparc/elementary-1.7.10/src/modules/test_map'
cd ../../.. && /usr/pkg/bin/gmake  am--refresh
gmake[5]: Entering directory '/tmp/pkgbuild/x11/elementary/work.sparc/elementary-1.7.10'
/bin/sh ./config.status --recheck
gmake[5]: Leaving directory '/tmp/pkgbuild/x11/elementary/work.sparc/elementary-1.7.10'
 cd ../../.. && /bin/sh ./config.status src/modules/test_map/Makefile depfiles
config.status: creating src/modules/test_map/Makefile
config.status: executing depfiles commands
cd ../../.. && /usr/pkg/bin/gmake  am--refresh
gmake[5]: Entering directory '/tmp/pkgbuild/x11/elementary/work.sparc/elementary-1.7.10'
/bin/sh ./config.status --recheck
gmake[5]: Leaving directory '/tmp/pkgbuild/x11/elementary/work.sparc/elementary-1.7.10'
  CC       module_la-mod.lo
  CCLD     module.la
gmake[4]: Leaving directory '/tmp/pkgbuild/x11/elementary/work.sparc/elementary-1.7.10/src/modules/test_map'
Making all in access_output
gmake[4]: Entering directory '/tmp/pkgbuild/x11/elementary/work.sparc/elementary-1.7.10/src/modules/access_output'
cd ../../.. && /usr/pkg/bin/gmake  am--refresh
gmake[5]: Entering directory '/tmp/pkgbuild/x11/elementary/work.sparc/elementary-1.7.10'
/bin/sh ./config.status --recheck
gmake[5]: Leaving directory '/tmp/pkgbuild/x11/elementary/work.sparc/elementary-1.7.10'
 cd ../../.. && /bin/sh ./config.status src/modules/access_output/Makefile depfiles
config.status: creating src/modules/access_output/Makefile
config.status: executing depfiles commands
cd ../../.. && /usr/pkg/bin/gmake  am--refresh
gmake[5]: Entering directory '/tmp/pkgbuild/x11/elementary/work.sparc/elementary-1.7.10'
/bin/sh ./config.status --recheck
gmake[5]: Leaving directory '/tmp/pkgbuild/x11/elementary/work.sparc/elementary-1.7.10'
  CC       module_la-mod.lo
  CCLD     module.la
gmake[4]: Leaving directory '/tmp/pkgbuild/x11/elementary/work.sparc/elementary-1.7.10/src/modules/access_output'
Making all in datetime_input_ctxpopup
gmake[4]: Entering directory '/tmp/pkgbuild/x11/elementary/work.sparc/elementary-1.7.10/src/modules/datetime_input_ctxpopup'
cd ../../.. && /usr/pkg/bin/gmake  am--refresh
gmake[5]: Entering directory '/tmp/pkgbuild/x11/elementary/work.sparc/elementary-1.7.10'
/bin/sh ./config.status --recheck
gmake[5]: Leaving directory '/tmp/pkgbuild/x11/elementary/work.sparc/elementary-1.7.10'
 cd ../../.. && /bin/sh ./config.status src/modules/datetime_input_ctxpopup/Makefile depfiles
config.status: creating src/modules/datetime_input_ctxpopup/Makefile
config.status: executing depfiles commands
cd ../../.. && /usr/pkg/bin/gmake  am--refresh
gmake[5]: Entering directory '/tmp/pkgbuild/x11/elementary/work.sparc/elementary-1.7.10'
/bin/sh ./config.status --recheck
gmake[5]: Leaving directory '/tmp/pkgbuild/x11/elementary/work.sparc/elementary-1.7.10'
  CC       module_la-datetime_input_ctxpopup.lo
  CCLD     module.la
gmake[4]: Leaving directory '/tmp/pkgbuild/x11/elementary/work.sparc/elementary-1.7.10/src/modules/datetime_input_ctxpopup'
gmake[4]: Entering directory '/tmp/pkgbuild/x11/elementary/work.sparc/elementary-1.7.10/src/modules'
cd ../.. && /usr/pkg/bin/gmake  am--refresh
gmake[5]: Entering directory '/tmp/pkgbuild/x11/elementary/work.sparc/elementary-1.7.10'
/bin/sh ./config.status --recheck
gmake[5]: Leaving directory '/tmp/pkgbuild/x11/elementary/work.sparc/elementary-1.7.10'
gmake[4]: Nothing to be done for 'all-am'.
gmake[4]: Leaving directory '/tmp/pkgbuild/x11/elementary/work.sparc/elementary-1.7.10/src/modules'
gmake[3]: Leaving directory '/tmp/pkgbuild/x11/elementary/work.sparc/elementary-1.7.10/src/modules'
Making all in edje_externals
gmake[3]: Entering directory '/tmp/pkgbuild/x11/elementary/work.sparc/elementary-1.7.10/src/edje_externals'
cd ../.. && /usr/pkg/bin/gmake  am--refresh
gmake[4]: Entering directory '/tmp/pkgbuild/x11/elementary/work.sparc/elementary-1.7.10'
/bin/sh ./config.status --recheck
gmake[4]: Leaving directory '/tmp/pkgbuild/x11/elementary/work.sparc/elementary-1.7.10'
 cd ../.. && /bin/sh ./config.status src/edje_externals/Makefile depfiles
config.status: creating src/edje_externals/Makefile
config.status: executing depfiles commands
cd ../.. && /usr/pkg/bin/gmake  am--refresh
gmake[4]: Entering directory '/tmp/pkgbuild/x11/elementary/work.sparc/elementary-1.7.10'
/bin/sh ./config.status --recheck
gmake[4]: Leaving directory '/tmp/pkgbuild/x11/elementary/work.sparc/elementary-1.7.10'
  CC       elm.lo
  CC       elm_actionslider.lo
  CC       elm_bubble.lo
  CC       elm_button.lo
  CC       elm_calendar.lo
  CC       elm_check.lo
  CC       elm_clock.lo
  CC       elm_entry.lo
  CC       elm_fileselector.lo
  CC       elm_fileselector_button.lo
  CC       elm_fileselector_entry.lo
  CC       elm_frame.lo
  CC       elm_gengrid.lo
  CC       elm_genlist.lo
  CC       elm_hoversel.lo
  CC       elm_icon.lo
  CC       elm_index.lo
  CC       elm_label.lo
  CC       elm_list.lo
  CC       elm_map.lo
  CC       elm_multibuttonentry.lo
  CC       elm_naviframe.lo
  CC       elm_notify.lo
  CC       elm_panes.lo
  CC       elm_photocam.lo
  CC       elm_progressbar.lo
  CC       elm_radio.lo
  CC       elm_scroller.lo
  CC       elm_segment_control.lo
  CC       elm_slider.lo
  CC       elm_slideshow.lo
  CC       elm_spinner.lo
  CC       elm_thumb.lo
  CC       elm_toolbar.lo
  CC       elm_video.lo
  CC       elm_web.lo
  CCLD     module.la
gmake[3]: Leaving directory '/tmp/pkgbuild/x11/elementary/work.sparc/elementary-1.7.10/src/edje_externals'
Making all in examples
gmake[3]: Entering directory '/tmp/pkgbuild/x11/elementary/work.sparc/elementary-1.7.10/src/examples'
cd ../.. && /usr/pkg/bin/gmake  am--refresh
gmake[4]: Entering directory '/tmp/pkgbuild/x11/elementary/work.sparc/elementary-1.7.10'
/bin/sh ./config.status --recheck
gmake[4]: Leaving directory '/tmp/pkgbuild/x11/elementary/work.sparc/elementary-1.7.10'
 cd ../.. && /bin/sh ./config.status src/examples/Makefile depfiles
config.status: creating src/examples/Makefile
config.status: executing depfiles commands
cd ../.. && /usr/pkg/bin/gmake  am--refresh
gmake[4]: Entering directory '/tmp/pkgbuild/x11/elementary/work.sparc/elementary-1.7.10'
/bin/sh ./config.status --recheck
gmake[4]: Leaving directory '/tmp/pkgbuild/x11/elementary/work.sparc/elementary-1.7.10'
gmake[3]: Nothing to be done for 'all'.
gmake[3]: Leaving directory '/tmp/pkgbuild/x11/elementary/work.sparc/elementary-1.7.10/src/examples'
gmake[3]: Entering directory '/tmp/pkgbuild/x11/elementary/work.sparc/elementary-1.7.10/src'
cd .. && /usr/pkg/bin/gmake  am--refresh
gmake[4]: Entering directory '/tmp/pkgbuild/x11/elementary/work.sparc/elementary-1.7.10'
/bin/sh ./config.status --recheck
gmake[4]: Leaving directory '/tmp/pkgbuild/x11/elementary/work.sparc/elementary-1.7.10'
gmake[3]: Nothing to be done for 'all-am'.
gmake[3]: Leaving directory '/tmp/pkgbuild/x11/elementary/work.sparc/elementary-1.7.10/src'
gmake[2]: Leaving directory '/tmp/pkgbuild/x11/elementary/work.sparc/elementary-1.7.10/src'
Making all in data
gmake[2]: Entering directory '/tmp/pkgbuild/x11/elementary/work.sparc/elementary-1.7.10/data'
cd .. && /usr/pkg/bin/gmake  am--refresh
gmake[3]: Entering directory '/tmp/pkgbuild/x11/elementary/work.sparc/elementary-1.7.10'
/bin/sh ./config.status --recheck
gmake[3]: Leaving directory '/tmp/pkgbuild/x11/elementary/work.sparc/elementary-1.7.10'
 cd .. && /bin/sh ./config.status data/Makefile 
config.status: creating data/Makefile
cd .. && /usr/pkg/bin/gmake  am--refresh
gmake[3]: Entering directory '/tmp/pkgbuild/x11/elementary/work.sparc/elementary-1.7.10'
/bin/sh ./config.status --recheck
gmake[3]: Leaving directory '/tmp/pkgbuild/x11/elementary/work.sparc/elementary-1.7.10'
Making all in themes
gmake[3]: Entering directory '/tmp/pkgbuild/x11/elementary/work.sparc/elementary-1.7.10/data/themes'
cd ../.. && /usr/pkg/bin/gmake  am--refresh
gmake[4]: Entering directory '/tmp/pkgbuild/x11/elementary/work.sparc/elementary-1.7.10'
/bin/sh ./config.status --recheck
gmake[4]: Leaving directory '/tmp/pkgbuild/x11/elementary/work.sparc/elementary-1.7.10'
 cd ../.. && /bin/sh ./config.status data/themes/Makefile 
config.status: creating data/themes/Makefile
cd ../.. && /usr/pkg/bin/gmake  am--refresh
gmake[4]: Entering directory '/tmp/pkgbuild/x11/elementary/work.sparc/elementary-1.7.10'
/bin/sh ./config.status --recheck
gmake[4]: Leaving directory '/tmp/pkgbuild/x11/elementary/work.sparc/elementary-1.7.10'
/usr/pkg/bin/edje_cc  -id ../../data/themes -fd ../../data/themes \
../../data/themes/default.edc \
../../data/themes/default.edj
edje_cc: Critical. Cannot create buffer engine canvas for image load.
gmake[3]: *** [Makefile:932: default.edj] Error 255
gmake[3]: Leaving directory '/tmp/pkgbuild/x11/elementary/work.sparc/elementary-1.7.10/data/themes'
gmake[2]: *** [Makefile:455: all-recursive] Error 1
gmake[2]: Leaving directory '/tmp/pkgbuild/x11/elementary/work.sparc/elementary-1.7.10/data'
gmake[1]: *** [Makefile:595: all-recursive] Error 1
gmake[1]: Leaving directory '/tmp/pkgbuild/x11/elementary/work.sparc/elementary-1.7.10'
gmake: *** [Makefile:502: all] Error 2
*** Error code 2

Stop.
make[1]: stopped in /usr/pkgsrc/x11/elementary
*** Error code 1

Stop.
make: stopped in /usr/pkgsrc/x11/elementary