=> Bootstrap dependency digest>=20211023: found digest-20220214
===> Skipping vulnerability checks.
WARNING: No /usr/pkg/pkgdb/pkg-vulnerabilities file found.
WARNING: To fix run: `/usr/sbin/pkg_admin -K /usr/pkg/pkgdb fetch-pkg-vulnerabilities'.
===> Building for gperftools-2.10
c++ -std=gnu++11 -DHAVE_CONFIG_H -I. -I./src  -I./src   -pthread -Wall -Wwrite-strings -Woverloaded-virtual -Wno-sign-compare  -Wno-unused-result -fsized-deallocation -faligned-new   -O2 -D_FORTIFY_SOURCE=2 -MT src/tests/debugallocation_test-debugallocation_test.o -MD -MP -MF src/tests/.deps/debugallocation_test-debugallocation_test.Tpo -c -o src/tests/debugallocation_test-debugallocation_test.o `test -f 'src/tests/debugallocation_test.cc' || echo './'`src/tests/debugallocation_test.cc
In file included from ./src/base/commandlineflags.h:56:0,
                 from ./src/base/logging.h:49,
                 from src/tests/debugallocation_test.cc:40:
./src/base/basictypes.h:391:5: error: #error Could not determine cache line length - unknown architecture
 #   error Could not determine cache line length - unknown architecture
     ^~~~~
distcc[4402] ERROR: compile src/tests/debugallocation_test.cc on 192.168.1.1:3648 failed
distcc[4402] (dcc_build_somewhere) Warning: remote compilation of 'src/tests/debugallocation_test.cc' failed, retrying locally
distcc[4402] Warning: failed to distribute src/tests/debugallocation_test.cc to 192.168.1.1:3648, running locally instead
In file included from ./src/base/commandlineflags.h:56:0,
                 from ./src/base/logging.h:49,
                 from src/tests/debugallocation_test.cc:40:
./src/base/basictypes.h:391:5: error: #error Could not determine cache line length - unknown architecture
 #   error Could not determine cache line length - unknown architecture
     ^~~~~
distcc[4402] ERROR: compile src/tests/debugallocation_test.cc on localhost failed
gmake: *** [Makefile:5603: src/tests/debugallocation_test-debugallocation_test.o] Error 1
*** Error code 2

Stop.
make[1]: stopped in /usr/pkgsrc/devel/gperftools
*** Error code 1

Stop.
make: stopped in /usr/pkgsrc/devel/gperftools