=> Bootstrap dependency digest>=20211023: found digest-20220214
===> Skipping vulnerability checks.
WARNING: No /usr/pkg/pkgdb/pkg-vulnerabilities file found.
WARNING: To fix run: `/usr/sbin/pkg_admin -K /usr/pkg/pkgdb fetch-pkg-vulnerabilities'.
===> Building for syncterm-1.1nb4
/usr/pkg/bin/gmake -C /tmp/pkgbuild/comms/syncterm/work.sparc/syncterm-1.1/src/xpdev mtlib
gmake[1]: Entering directory '/tmp/pkgbuild/comms/syncterm/work.sparc/syncterm-1.1/src/xpdev'
Compiling conwrap.c
Compiling dat_file.c
In file included from dat_file.c:39:0:
genwrap.h:211:3: error: #error "Need to describe target architecture"
  #error "Need to describe target architecture"
   ^~~~~
genwrap.h:219:0: warning: "snprintf" redefined
  #define snprintf  safe_snprintf
 
In file included from /usr/include/stdio.h:597:0,
                 from str_list.h:41,
                 from dat_file.h:41,
                 from dat_file.c:38:
/usr/include/ssp/stdio.h:61:0: note: this is the location of the previous definition
 #define snprintf(str, len, ...) \
 
distcc[6109] ERROR: compile dat_file.c on 192.168.1.1:3648 failed
distcc[6109] (dcc_build_somewhere) Warning: remote compilation of 'dat_file.c' failed, retrying locally
distcc[6109] Warning: failed to distribute dat_file.c to 192.168.1.1:3648, running locally instead
In file included from dat_file.c:39:0:
genwrap.h:211:3: error: #error "Need to describe target architecture"
  #error "Need to describe target architecture"
   ^~~~~
genwrap.h:219:0: warning: "snprintf" redefined
  #define snprintf  safe_snprintf
 
In file included from /usr/include/stdio.h:597:0,
                 from str_list.h:41,
                 from dat_file.h:41,
                 from dat_file.c:38:
/usr/include/ssp/stdio.h:61:0: note: this is the location of the previous definition
 #define snprintf(str, len, ...) \
 
distcc[6109] ERROR: compile dat_file.c on localhost failed
gmake[1]: *** [/tmp/pkgbuild/comms/syncterm/work.sparc/syncterm-1.1/src/build/Common.gmake:456: gcc.netbsd.sparc.obj.release-mt/dat_file.o] Error 1
gmake[1]: Leaving directory '/tmp/pkgbuild/comms/syncterm/work.sparc/syncterm-1.1/src/xpdev'
gmake: *** [/tmp/pkgbuild/comms/syncterm/work.sparc/syncterm-1.1/src/build/Common.gmake:487: xpdev-mt] Error 2
*** Error code 2

Stop.
make[1]: stopped in /usr/pkgsrc/comms/syncterm
*** Error code 1

Stop.
make: stopped in /usr/pkgsrc/comms/syncterm