=> Bootstrap dependency digest>=20211023: found digest-20220214
===> Skipping vulnerability checks.
WARNING: No /usr/pkg/pkgdb/pkg-vulnerabilities file found.
WARNING: To fix run: `/usr/sbin/pkg_admin -K /usr/pkg/pkgdb fetch-pkg-vulnerabilities'.
===> Building for djbsort-20190516nb1
cd /tmp/pkgbuild/math/djbsort/work.sparc64/djbsort-20190516 && ./build
build starting
version 20190516
hostname pkgsrchostname
compilers/abiname.c compiling gcc -fPIC -Wall -fomit-frame-pointer -fwrapv -O3
compilers/abiname.c compiling gcc -fPIC -Wall -fomit-frame-pointer -fwrapv -march=core-avx2 -O3
output
> gcc: error: unrecognized command line option ‘-march=core-avx2’
> distcc[19273] ERROR: compile abiname.c on 10.1.1.1:3642 failed
> distcc[19273] (dcc_build_somewhere) Warning: remote compilation of 'abiname.c' failed, retrying locally
> distcc[19273] Warning: failed to distribute abiname.c to 10.1.1.1:3642, running locally instead
> gcc: error: unrecognized command line option ‘-march=core-avx2’
> distcc[19273] ERROR: compile abiname.c on localhost failed
compilers/abiname.c compiler exited 1
output
> gcc: error: unrecognized command line option ‘-march=core-avx2’
> distcc[6378] ERROR: compile base.c on 10.1.1.1:3642 failed
> distcc[6378] (dcc_build_somewhere) Warning: remote compilation of 'base.c' failed, retrying locally
> distcc[6378] Warning: failed to distribute base.c to 10.1.1.1:3642, running locally instead
> gcc: error: unrecognized command line option ‘-march=core-avx2’
> distcc[6378] ERROR: compile base.c on localhost failed
compilers/base.c compiler exited 1
compilers/abiname.c compiling clang -fPIC -Wall -fomit-frame-pointer -fwrapv -Qunused-arguments -O3
output
> gcc: error: unrecognized command line option ‘-Qunused-arguments’; did you mean ‘-Wunused-parameter’?
> distcc[9045] ERROR: compile abiname.c on 10.1.1.1:3642 failed
> distcc[9045] (dcc_build_somewhere) Warning: remote compilation of 'abiname.c' failed, retrying locally
> distcc[9045] Warning: failed to distribute abiname.c to 10.1.1.1:3642, running locally instead
> gcc: error: unrecognized command line option ‘-Qunused-arguments’; did you mean ‘-Wunused-parameter’?
> distcc[9045] ERROR: compile abiname.c on localhost failed
compilers/abiname.c compiler exited 1
output
> gcc: error: unrecognized command line option ‘-Qunused-arguments’; did you mean ‘-Wunused-parameter’?
> distcc[20086] ERROR: compile base.c on 10.1.1.1:3642 failed
> distcc[20086] (dcc_build_somewhere) Warning: remote compilation of 'base.c' failed, retrying locally
> distcc[20086] Warning: failed to distribute base.c to 10.1.1.1:3642, running locally instead
> gcc: error: unrecognized command line option ‘-Qunused-arguments’; did you mean ‘-Wunused-parameter’?
> distcc[20086] ERROR: compile base.c on localhost failed
compilers/base.c compiler exited 1
compilers/abiname.c compiling clang -fPIC -Wall -fomit-frame-pointer -fwrapv -Qunused-arguments -mavx2 -O3
output
> gcc: error: unrecognized command line option ‘-Qunused-arguments’; did you mean ‘-Wunused-parameter’?
> gcc: error: unrecognized command line option ‘-mavx2’
> distcc[26019] ERROR: compile abiname.c on 10.1.1.1:3642 failed
> distcc[26019] (dcc_build_somewhere) Warning: remote compilation of 'abiname.c' failed, retrying locally
> distcc[26019] Warning: failed to distribute abiname.c to 10.1.1.1:3642, running locally instead
> gcc: error: unrecognized command line option ‘-Qunused-arguments’; did you mean ‘-Wunused-parameter’?
> gcc: error: unrecognized command line option ‘-mavx2’
> distcc[26019] ERROR: compile abiname.c on localhost failed
compilers/abiname.c compiler exited 1
output
> gcc: error: unrecognized command line option ‘-Qunused-arguments’; did you mean ‘-Wunused-parameter’?
> gcc: error: unrecognized command line option ‘-mavx2’
> distcc[20036] ERROR: compile base.c on 10.1.1.1:3642 failed
> distcc[20036] (dcc_build_somewhere) Warning: remote compilation of 'base.c' failed, retrying locally
> distcc[20036] Warning: failed to distribute base.c to 10.1.1.1:3642, running locally instead
> gcc: error: unrecognized command line option ‘-Qunused-arguments’; did you mean ‘-Wunused-parameter’?
> gcc: error: unrecognized command line option ‘-mavx2’
> distcc[20036] ERROR: compile base.c on localhost failed
compilers/base.c compiler exited 1
cpucycles/amd64cpuinfo compiling gcc -fPIC -Wall -fomit-frame-pointer -fwrapv -O3
output
> distcc[10704] ERROR: compile cpucycles.c on 10.1.1.1:3642 failed
> distcc[10704] (dcc_build_somewhere) Warning: remote compilation of 'cpucycles.c' failed, retrying locally
> distcc[10704] Warning: failed to distribute cpucycles.c to 10.1.1.1:3642, running locally instead
> cpucycles.c: In function ‘djbsort_cpucycles’:
> cpucycles.c:10:3: error: unknown register name ‘%rdx’ in ‘asm’
>    asm volatile(".byte 15;.byte 49;shlq $32,%%rdx;orq %%rdx,%%rax"
>    ^~~
> distcc[10704] ERROR: compile cpucycles.c on localhost failed
cpucycles/cpucycles.c compiler exited 1
cpucycles/amd64cpuinfo compiling gcc -fPIC -Wall -fomit-frame-pointer -fwrapv -march=core-avx2 -O3
output
> gcc: error: unrecognized command line option ‘-march=core-avx2’
> distcc[18484] ERROR: compile cpucycles.c on 10.1.1.1:3642 failed
> distcc[18484] (dcc_build_somewhere) Warning: remote compilation of 'cpucycles.c' failed, retrying locally
> distcc[18484] Warning: failed to distribute cpucycles.c to 10.1.1.1:3642, running locally instead
> gcc: error: unrecognized command line option ‘-march=core-avx2’
> distcc[18484] ERROR: compile cpucycles.c on localhost failed
cpucycles/cpucycles.c compiler exited 1
cpucycles/amd64cpuinfo compiling clang -fPIC -Wall -fomit-frame-pointer -fwrapv -Qunused-arguments -O3
output
> gcc: error: unrecognized command line option ‘-Qunused-arguments’; did you mean ‘-Wunused-parameter’?
> distcc[27615] ERROR: compile cpucycles.c on 10.1.1.1:3642 failed
> distcc[27615] (dcc_build_somewhere) Warning: remote compilation of 'cpucycles.c' failed, retrying locally
> distcc[27615] Warning: failed to distribute cpucycles.c to 10.1.1.1:3642, running locally instead
> gcc: error: unrecognized command line option ‘-Qunused-arguments’; did you mean ‘-Wunused-parameter’?
> distcc[27615] ERROR: compile cpucycles.c on localhost failed
cpucycles/cpucycles.c compiler exited 1
cpucycles/amd64cpuinfo compiling clang -fPIC -Wall -fomit-frame-pointer -fwrapv -Qunused-arguments -mavx2 -O3
output
> gcc: error: unrecognized command line option ‘-Qunused-arguments’; did you mean ‘-Wunused-parameter’?
> gcc: error: unrecognized command line option ‘-mavx2’
> distcc[25066] ERROR: compile cpucycles.c on 10.1.1.1:3642 failed
> distcc[25066] (dcc_build_somewhere) Warning: remote compilation of 'cpucycles.c' failed, retrying locally
> distcc[25066] Warning: failed to distribute cpucycles.c to 10.1.1.1:3642, running locally instead
> gcc: error: unrecognized command line option ‘-Qunused-arguments’; did you mean ‘-Wunused-parameter’?
> gcc: error: unrecognized command line option ‘-mavx2’
> distcc[25066] ERROR: compile cpucycles.c on localhost failed
cpucycles/cpucycles.c compiler exited 1
cpucycles/amd64cpuspeed compiling gcc -fPIC -Wall -fomit-frame-pointer -fwrapv -O3
output
> distcc[18419] ERROR: compile cpucycles.c on 10.1.1.1:3642 failed
> distcc[18419] (dcc_build_somewhere) Warning: remote compilation of 'cpucycles.c' failed, retrying locally
> distcc[18419] Warning: failed to distribute cpucycles.c to 10.1.1.1:3642, running locally instead
> cpucycles.c: In function ‘djbsort_cpucycles_persecond’:
> cpucycles.c:21:12: error: ‘HW_CPUSPEED’ undeclared (first use in this function); did you mean ‘LW_WSUSPEND’?
>    oid[1] = HW_CPUSPEED;
>             ^~~~~~~~~~~
>             LW_WSUSPEND
> cpucycles.c:21:12: note: each undeclared identifier is reported only once for each function it appears in
> distcc[18419] ERROR: compile cpucycles.c on localhost failed
cpucycles/cpucycles.c compiler exited 1
cpucycles/amd64cpuspeed compiling gcc -fPIC -Wall -fomit-frame-pointer -fwrapv -march=core-avx2 -O3
output
> gcc: error: unrecognized command line option ‘-march=core-avx2’
> distcc[1516] ERROR: compile cpucycles.c on 10.1.1.1:3642 failed
> distcc[1516] (dcc_build_somewhere) Warning: remote compilation of 'cpucycles.c' failed, retrying locally
> distcc[1516] Warning: failed to distribute cpucycles.c to 10.1.1.1:3642, running locally instead
> gcc: error: unrecognized command line option ‘-march=core-avx2’
> distcc[1516] ERROR: compile cpucycles.c on localhost failed
cpucycles/cpucycles.c compiler exited 1
cpucycles/amd64cpuspeed compiling clang -fPIC -Wall -fomit-frame-pointer -fwrapv -Qunused-arguments -O3
output
> gcc: error: unrecognized command line option ‘-Qunused-arguments’; did you mean ‘-Wunused-parameter’?
> distcc[1538] ERROR: compile cpucycles.c on 10.1.1.1:3642 failed
> distcc[1538] (dcc_build_somewhere) Warning: remote compilation of 'cpucycles.c' failed, retrying locally
> distcc[1538] Warning: failed to distribute cpucycles.c to 10.1.1.1:3642, running locally instead
> gcc: error: unrecognized command line option ‘-Qunused-arguments’; did you mean ‘-Wunused-parameter’?
> distcc[1538] ERROR: compile cpucycles.c on localhost failed
cpucycles/cpucycles.c compiler exited 1
cpucycles/amd64cpuspeed compiling clang -fPIC -Wall -fomit-frame-pointer -fwrapv -Qunused-arguments -mavx2 -O3
output
> gcc: error: unrecognized command line option ‘-Qunused-arguments’; did you mean ‘-Wunused-parameter’?
> gcc: error: unrecognized command line option ‘-mavx2’
> distcc[21578] ERROR: compile cpucycles.c on 10.1.1.1:3642 failed
> distcc[21578] (dcc_build_somewhere) Warning: remote compilation of 'cpucycles.c' failed, retrying locally
> distcc[21578] Warning: failed to distribute cpucycles.c to 10.1.1.1:3642, running locally instead
> gcc: error: unrecognized command line option ‘-Qunused-arguments’; did you mean ‘-Wunused-parameter’?
> gcc: error: unrecognized command line option ‘-mavx2’
> distcc[21578] ERROR: compile cpucycles.c on localhost failed
cpucycles/cpucycles.c compiler exited 1
cpucycles/amd64tscfreq compiling gcc -fPIC -Wall -fomit-frame-pointer -fwrapv -O3
output
> distcc[20064] ERROR: compile cpucycles.c on 10.1.1.1:3642 failed
> distcc[20064] (dcc_build_somewhere) Warning: remote compilation of 'cpucycles.c' failed, retrying locally
> distcc[20064] Warning: failed to distribute cpucycles.c to 10.1.1.1:3642, running locally instead
> cpucycles.c: In function ‘djbsort_cpucycles_persecond’:
> cpucycles.c:17:3: warning: implicit declaration of function ‘sysctlbyname’ [-Wimplicit-function-declaration]
>    sysctlbyname("machdep.tsc_freq",&result,&resultlen,0,0);
>    ^~~~~~~~~~~~
> cpucycles.c: In function ‘djbsort_cpucycles’:
> cpucycles.c:8:3: error: unknown register name ‘%rdx’ in ‘asm’
>    asm volatile(".byte 15;.byte 49;shlq $32,%%rdx;orq %%rdx,%%rax"
>    ^~~
> distcc[20064] ERROR: compile cpucycles.c on localhost failed
cpucycles/cpucycles.c compiler exited 1
cpucycles/amd64tscfreq compiling gcc -fPIC -Wall -fomit-frame-pointer -fwrapv -march=core-avx2 -O3
output
> gcc: error: unrecognized command line option ‘-march=core-avx2’
> distcc[21145] ERROR: compile cpucycles.c on 10.1.1.1:3642 failed
> distcc[21145] (dcc_build_somewhere) Warning: remote compilation of 'cpucycles.c' failed, retrying locally
> distcc[21145] Warning: failed to distribute cpucycles.c to 10.1.1.1:3642, running locally instead
> gcc: error: unrecognized command line option ‘-march=core-avx2’
> distcc[21145] ERROR: compile cpucycles.c on localhost failed
cpucycles/cpucycles.c compiler exited 1
cpucycles/amd64tscfreq compiling clang -fPIC -Wall -fomit-frame-pointer -fwrapv -Qunused-arguments -O3
output
> gcc: error: unrecognized command line option ‘-Qunused-arguments’; did you mean ‘-Wunused-parameter’?
> distcc[24538] ERROR: compile cpucycles.c on 10.1.1.1:3642 failed
> distcc[24538] (dcc_build_somewhere) Warning: remote compilation of 'cpucycles.c' failed, retrying locally
> distcc[24538] Warning: failed to distribute cpucycles.c to 10.1.1.1:3642, running locally instead
> gcc: error: unrecognized command line option ‘-Qunused-arguments’; did you mean ‘-Wunused-parameter’?
> distcc[24538] ERROR: compile cpucycles.c on localhost failed
cpucycles/cpucycles.c compiler exited 1
cpucycles/amd64tscfreq compiling clang -fPIC -Wall -fomit-frame-pointer -fwrapv -Qunused-arguments -mavx2 -O3
output
> gcc: error: unrecognized command line option ‘-Qunused-arguments’; did you mean ‘-Wunused-parameter’?
> gcc: error: unrecognized command line option ‘-mavx2’
> distcc[29984] ERROR: compile cpucycles.c on 10.1.1.1:3642 failed
> distcc[29984] (dcc_build_somewhere) Warning: remote compilation of 'cpucycles.c' failed, retrying locally
> distcc[29984] Warning: failed to distribute cpucycles.c to 10.1.1.1:3642, running locally instead
> gcc: error: unrecognized command line option ‘-Qunused-arguments’; did you mean ‘-Wunused-parameter’?
> gcc: error: unrecognized command line option ‘-mavx2’
> distcc[29984] ERROR: compile cpucycles.c on localhost failed
cpucycles/cpucycles.c compiler exited 1
cpucycles/apple compiling gcc -fPIC -Wall -fomit-frame-pointer -fwrapv -O3
output
> cpucycles.c:6:10: fatal error: mach/mach_time.h: No such file or directory
>  #include <mach/mach_time.h>
>           ^~~~~~~~~~~~~~~~~~
> compilation terminated.
> distcc[20517] ERROR: compile cpucycles.c on 10.1.1.1:3642 failed
> distcc[20517] (dcc_build_somewhere) Warning: remote compilation of 'cpucycles.c' failed, retrying locally
> distcc[20517] Warning: failed to distribute cpucycles.c to 10.1.1.1:3642, running locally instead
> cpucycles.c:6:10: fatal error: mach/mach_time.h: No such file or directory
>  #include <mach/mach_time.h>
>           ^~~~~~~~~~~~~~~~~~
> compilation terminated.
> distcc[20517] ERROR: compile cpucycles.c on localhost failed
cpucycles/cpucycles.c compiler exited 1
cpucycles/apple compiling gcc -fPIC -Wall -fomit-frame-pointer -fwrapv -march=core-avx2 -O3
output
> gcc: error: unrecognized command line option ‘-march=core-avx2’
> distcc[14692] ERROR: compile cpucycles.c on 10.1.1.1:3642 failed
> distcc[14692] (dcc_build_somewhere) Warning: remote compilation of 'cpucycles.c' failed, retrying locally
> distcc[14692] Warning: failed to distribute cpucycles.c to 10.1.1.1:3642, running locally instead
> gcc: error: unrecognized command line option ‘-march=core-avx2’
> distcc[14692] ERROR: compile cpucycles.c on localhost failed
cpucycles/cpucycles.c compiler exited 1
cpucycles/apple compiling clang -fPIC -Wall -fomit-frame-pointer -fwrapv -Qunused-arguments -O3
output
> gcc: error: unrecognized command line option ‘-Qunused-arguments’; did you mean ‘-Wunused-parameter’?
> distcc[24647] ERROR: compile cpucycles.c on 10.1.1.1:3642 failed
> distcc[24647] (dcc_build_somewhere) Warning: remote compilation of 'cpucycles.c' failed, retrying locally
> distcc[24647] Warning: failed to distribute cpucycles.c to 10.1.1.1:3642, running locally instead
> gcc: error: unrecognized command line option ‘-Qunused-arguments’; did you mean ‘-Wunused-parameter’?
> distcc[24647] ERROR: compile cpucycles.c on localhost failed
cpucycles/cpucycles.c compiler exited 1
cpucycles/apple compiling clang -fPIC -Wall -fomit-frame-pointer -fwrapv -Qunused-arguments -mavx2 -O3
output
> gcc: error: unrecognized command line option ‘-Qunused-arguments’; did you mean ‘-Wunused-parameter’?
> gcc: error: unrecognized command line option ‘-mavx2’
> distcc[17044] ERROR: compile cpucycles.c on 10.1.1.1:3642 failed
> distcc[17044] (dcc_build_somewhere) Warning: remote compilation of 'cpucycles.c' failed, retrying locally
> distcc[17044] Warning: failed to distribute cpucycles.c to 10.1.1.1:3642, running locally instead
> gcc: error: unrecognized command line option ‘-Qunused-arguments’; did you mean ‘-Wunused-parameter’?
> gcc: error: unrecognized command line option ‘-mavx2’
> distcc[17044] ERROR: compile cpucycles.c on localhost failed
cpucycles/cpucycles.c compiler exited 1
cpucycles/celllinux compiling gcc -fPIC -Wall -fomit-frame-pointer -fwrapv -O3
output
> cpucycles.c:6:10: fatal error: spu_mfcio.h: No such file or directory
>  #include <spu_mfcio.h>
>           ^~~~~~~~~~~~~
> compilation terminated.
> distcc[14066] ERROR: compile cpucycles.c on 10.1.1.1:3642 failed
> distcc[14066] (dcc_build_somewhere) Warning: remote compilation of 'cpucycles.c' failed, retrying locally
> distcc[14066] Warning: failed to distribute cpucycles.c to 10.1.1.1:3642, running locally instead
> cpucycles.c:6:10: fatal error: spu_mfcio.h: No such file or directory
>  #include <spu_mfcio.h>
>           ^~~~~~~~~~~~~
> compilation terminated.
> distcc[14066] ERROR: compile cpucycles.c on localhost failed
cpucycles/cpucycles.c compiler exited 1
cpucycles/celllinux compiling gcc -fPIC -Wall -fomit-frame-pointer -fwrapv -march=core-avx2 -O3
output
> gcc: error: unrecognized command line option ‘-march=core-avx2’
> distcc[29791] ERROR: compile cpucycles.c on 10.1.1.1:3642 failed
> distcc[29791] (dcc_build_somewhere) Warning: remote compilation of 'cpucycles.c' failed, retrying locally
> distcc[29791] Warning: failed to distribute cpucycles.c to 10.1.1.1:3642, running locally instead
> gcc: error: unrecognized command line option ‘-march=core-avx2’
> distcc[29791] ERROR: compile cpucycles.c on localhost failed
cpucycles/cpucycles.c compiler exited 1
cpucycles/celllinux compiling clang -fPIC -Wall -fomit-frame-pointer -fwrapv -Qunused-arguments -O3
output
> gcc: error: unrecognized command line option ‘-Qunused-arguments’; did you mean ‘-Wunused-parameter’?
> distcc[29396] ERROR: compile cpucycles.c on 10.1.1.1:3642 failed
> distcc[29396] (dcc_build_somewhere) Warning: remote compilation of 'cpucycles.c' failed, retrying locally
> distcc[29396] Warning: failed to distribute cpucycles.c to 10.1.1.1:3642, running locally instead
> gcc: error: unrecognized command line option ‘-Qunused-arguments’; did you mean ‘-Wunused-parameter’?
> distcc[29396] ERROR: compile cpucycles.c on localhost failed
cpucycles/cpucycles.c compiler exited 1
cpucycles/celllinux compiling clang -fPIC -Wall -fomit-frame-pointer -fwrapv -Qunused-arguments -mavx2 -O3
output
> gcc: error: unrecognized command line option ‘-Qunused-arguments’; did you mean ‘-Wunused-parameter’?
> gcc: error: unrecognized command line option ‘-mavx2’
> distcc[3006] ERROR: compile cpucycles.c on 10.1.1.1:3642 failed
> distcc[3006] (dcc_build_somewhere) Warning: remote compilation of 'cpucycles.c' failed, retrying locally
> distcc[3006] Warning: failed to distribute cpucycles.c to 10.1.1.1:3642, running locally instead
> gcc: error: unrecognized command line option ‘-Qunused-arguments’; did you mean ‘-Wunused-parameter’?
> gcc: error: unrecognized command line option ‘-mavx2’
> distcc[3006] ERROR: compile cpucycles.c on localhost failed
cpucycles/cpucycles.c compiler exited 1
cpucycles/cortex compiling gcc -fPIC -Wall -fomit-frame-pointer -fwrapv -O3
output
> distcc[5531] ERROR: compile cpucycles.c on 10.1.1.1:3642 failed
> distcc[5531] (dcc_build_somewhere) Warning: remote compilation of 'cpucycles.c' failed, retrying locally
> distcc[5531] Warning: failed to distribute cpucycles.c to 10.1.1.1:3642, running locally instead
> /tmp//ccmLx6gu.s: Assembler messages:
> /tmp//ccmLx6gu.s:34: Error: Unknown opcode: `mcr'
> /tmp//ccmLx6gu.s:39: Error: Unknown opcode: `mcr'
> /tmp//ccmLx6gu.s:42: Error: Unknown opcode: `mcr'
> /tmp//ccmLx6gu.s:48: Error: Unknown opcode: `mrc'
> distcc[5531] ERROR: compile cpucycles.c on localhost failed
cpucycles/cpucycles.c compiler exited 1
cpucycles/cortex compiling gcc -fPIC -Wall -fomit-frame-pointer -fwrapv -march=core-avx2 -O3
output
> gcc: error: unrecognized command line option ‘-march=core-avx2’
> distcc[22799] ERROR: compile cpucycles.c on 10.1.1.1:3642 failed
> distcc[22799] (dcc_build_somewhere) Warning: remote compilation of 'cpucycles.c' failed, retrying locally
> distcc[22799] Warning: failed to distribute cpucycles.c to 10.1.1.1:3642, running locally instead
> gcc: error: unrecognized command line option ‘-march=core-avx2’
> distcc[22799] ERROR: compile cpucycles.c on localhost failed
cpucycles/cpucycles.c compiler exited 1
cpucycles/cortex compiling clang -fPIC -Wall -fomit-frame-pointer -fwrapv -Qunused-arguments -O3
output
> gcc: error: unrecognized command line option ‘-Qunused-arguments’; did you mean ‘-Wunused-parameter’?
> distcc[1220] ERROR: compile cpucycles.c on 10.1.1.1:3642 failed
> distcc[1220] (dcc_build_somewhere) Warning: remote compilation of 'cpucycles.c' failed, retrying locally
> distcc[1220] Warning: failed to distribute cpucycles.c to 10.1.1.1:3642, running locally instead
> gcc: error: unrecognized command line option ‘-Qunused-arguments’; did you mean ‘-Wunused-parameter’?
> distcc[1220] ERROR: compile cpucycles.c on localhost failed
cpucycles/cpucycles.c compiler exited 1
cpucycles/cortex compiling clang -fPIC -Wall -fomit-frame-pointer -fwrapv -Qunused-arguments -mavx2 -O3
output
> gcc: error: unrecognized command line option ‘-Qunused-arguments’; did you mean ‘-Wunused-parameter’?
> gcc: error: unrecognized command line option ‘-mavx2’
> distcc[25393] ERROR: compile cpucycles.c on 10.1.1.1:3642 failed
> distcc[25393] (dcc_build_somewhere) Warning: remote compilation of 'cpucycles.c' failed, retrying locally
> distcc[25393] Warning: failed to distribute cpucycles.c to 10.1.1.1:3642, running locally instead
> gcc: error: unrecognized command line option ‘-Qunused-arguments’; did you mean ‘-Wunused-parameter’?
> gcc: error: unrecognized command line option ‘-mavx2’
> distcc[25393] ERROR: compile cpucycles.c on localhost failed
cpucycles/cpucycles.c compiler exited 1
cpucycles/cortex_vct compiling gcc -fPIC -Wall -fomit-frame-pointer -fwrapv -O3
output
> distcc[27165] ERROR: compile cpucycles.c on 10.1.1.1:3642 failed
> distcc[27165] (dcc_build_somewhere) Warning: remote compilation of 'cpucycles.c' failed, retrying locally
> distcc[27165] Warning: failed to distribute cpucycles.c to 10.1.1.1:3642, running locally instead
> /tmp//cclA0Ssh.s: Assembler messages:
> /tmp//cclA0Ssh.s:12: Error: Unknown opcode: `mrs'
> /tmp//cclA0Ssh.s:88: Error: Unknown opcode: `mrs'
> distcc[27165] ERROR: compile cpucycles.c on localhost failed
cpucycles/cpucycles.c compiler exited 1
cpucycles/cortex_vct compiling gcc -fPIC -Wall -fomit-frame-pointer -fwrapv -march=core-avx2 -O3
output
> gcc: error: unrecognized command line option ‘-march=core-avx2’
> distcc[18801] ERROR: compile cpucycles.c on 10.1.1.1:3642 failed
> distcc[18801] (dcc_build_somewhere) Warning: remote compilation of 'cpucycles.c' failed, retrying locally
> distcc[18801] Warning: failed to distribute cpucycles.c to 10.1.1.1:3642, running locally instead
> gcc: error: unrecognized command line option ‘-march=core-avx2’
> distcc[18801] ERROR: compile cpucycles.c on localhost failed
cpucycles/cpucycles.c compiler exited 1
cpucycles/cortex_vct compiling clang -fPIC -Wall -fomit-frame-pointer -fwrapv -Qunused-arguments -O3
output
> gcc: error: unrecognized command line option ‘-Qunused-arguments’; did you mean ‘-Wunused-parameter’?
> distcc[14847] ERROR: compile cpucycles.c on 10.1.1.1:3642 failed
> distcc[14847] (dcc_build_somewhere) Warning: remote compilation of 'cpucycles.c' failed, retrying locally
> distcc[14847] Warning: failed to distribute cpucycles.c to 10.1.1.1:3642, running locally instead
> gcc: error: unrecognized command line option ‘-Qunused-arguments’; did you mean ‘-Wunused-parameter’?
> distcc[14847] ERROR: compile cpucycles.c on localhost failed
cpucycles/cpucycles.c compiler exited 1
cpucycles/cortex_vct compiling clang -fPIC -Wall -fomit-frame-pointer -fwrapv -Qunused-arguments -mavx2 -O3
output
> gcc: error: unrecognized command line option ‘-Qunused-arguments’; did you mean ‘-Wunused-parameter’?
> gcc: error: unrecognized command line option ‘-mavx2’
> distcc[10386] ERROR: compile cpucycles.c on 10.1.1.1:3642 failed
> distcc[10386] (dcc_build_somewhere) Warning: remote compilation of 'cpucycles.c' failed, retrying locally
> distcc[10386] Warning: failed to distribute cpucycles.c to 10.1.1.1:3642, running locally instead
> gcc: error: unrecognized command line option ‘-Qunused-arguments’; did you mean ‘-Wunused-parameter’?
> gcc: error: unrecognized command line option ‘-mavx2’
> distcc[10386] ERROR: compile cpucycles.c on localhost failed
cpucycles/cpucycles.c compiler exited 1
cpucycles/dev4ns compiling gcc -fPIC -Wall -fomit-frame-pointer -fwrapv -O3
cpucycles warning: namespace violation: cpucycles.o __sparc_get_pc_thunk.l7 W djbsort_cpucycles_priv___sparc_get_pc_thunk.l7
cpucycles/dev4ns compiling gcc -fPIC -Wall -fomit-frame-pointer -fwrapv -march=core-avx2 -O3
output
> gcc: error: unrecognized command line option ‘-march=core-avx2’
> distcc[15355] ERROR: compile cpucycles.c on 10.1.1.1:3642 failed
> distcc[15355] (dcc_build_somewhere) Warning: remote compilation of 'cpucycles.c' failed, retrying locally
> distcc[15355] Warning: failed to distribute cpucycles.c to 10.1.1.1:3642, running locally instead
> gcc: error: unrecognized command line option ‘-march=core-avx2’
> distcc[15355] ERROR: compile cpucycles.c on localhost failed
cpucycles/cpucycles.c compiler exited 1
cpucycles/dev4ns compiling clang -fPIC -Wall -fomit-frame-pointer -fwrapv -Qunused-arguments -O3
output
> gcc: error: unrecognized command line option ‘-Qunused-arguments’; did you mean ‘-Wunused-parameter’?
> distcc[3867] ERROR: compile cpucycles.c on 10.1.1.1:3642 failed
> distcc[3867] (dcc_build_somewhere) Warning: remote compilation of 'cpucycles.c' failed, retrying locally
> distcc[3867] Warning: failed to distribute cpucycles.c to 10.1.1.1:3642, running locally instead
> gcc: error: unrecognized command line option ‘-Qunused-arguments’; did you mean ‘-Wunused-parameter’?
> distcc[3867] ERROR: compile cpucycles.c on localhost failed
cpucycles/cpucycles.c compiler exited 1
cpucycles/dev4ns compiling clang -fPIC -Wall -fomit-frame-pointer -fwrapv -Qunused-arguments -mavx2 -O3
output
> gcc: error: unrecognized command line option ‘-Qunused-arguments’; did you mean ‘-Wunused-parameter’?
> gcc: error: unrecognized command line option ‘-mavx2’
> distcc[19697] ERROR: compile cpucycles.c on 10.1.1.1:3642 failed
> distcc[19697] (dcc_build_somewhere) Warning: remote compilation of 'cpucycles.c' failed, retrying locally
> distcc[19697] Warning: failed to distribute cpucycles.c to 10.1.1.1:3642, running locally instead
> gcc: error: unrecognized command line option ‘-Qunused-arguments’; did you mean ‘-Wunused-parameter’?
> gcc: error: unrecognized command line option ‘-mavx2’
> distcc[19697] ERROR: compile cpucycles.c on localhost failed
cpucycles/cpucycles.c compiler exited 1
cpucycles/gettimeofday compiling gcc -fPIC -Wall -fomit-frame-pointer -fwrapv -O3
cpucycles warning: namespace violation: cpucycles.o __sparc_get_pc_thunk.l7 W djbsort_cpucycles_priv___sparc_get_pc_thunk.l7
cpucycles/gettimeofday compiling gcc -fPIC -Wall -fomit-frame-pointer -fwrapv -march=core-avx2 -O3
output
> gcc: error: unrecognized command line option ‘-march=core-avx2’
> distcc[8899] ERROR: compile cpucycles.c on 10.1.1.1:3642 failed
> distcc[8899] (dcc_build_somewhere) Warning: remote compilation of 'cpucycles.c' failed, retrying locally
> distcc[8899] Warning: failed to distribute cpucycles.c to 10.1.1.1:3642, running locally instead
> gcc: error: unrecognized command line option ‘-march=core-avx2’
> distcc[8899] ERROR: compile cpucycles.c on localhost failed
cpucycles/cpucycles.c compiler exited 1
cpucycles/gettimeofday compiling clang -fPIC -Wall -fomit-frame-pointer -fwrapv -Qunused-arguments -O3
output
> gcc: error: unrecognized command line option ‘-Qunused-arguments’; did you mean ‘-Wunused-parameter’?
> distcc[9610] ERROR: compile cpucycles.c on 10.1.1.1:3642 failed
> distcc[9610] (dcc_build_somewhere) Warning: remote compilation of 'cpucycles.c' failed, retrying locally
> distcc[9610] Warning: failed to distribute cpucycles.c to 10.1.1.1:3642, running locally instead
> gcc: error: unrecognized command line option ‘-Qunused-arguments’; did you mean ‘-Wunused-parameter’?
> distcc[9610] ERROR: compile cpucycles.c on localhost failed
cpucycles/cpucycles.c compiler exited 1
cpucycles/gettimeofday compiling clang -fPIC -Wall -fomit-frame-pointer -fwrapv -Qunused-arguments -mavx2 -O3
output
> gcc: error: unrecognized command line option ‘-Qunused-arguments’; did you mean ‘-Wunused-parameter’?
> gcc: error: unrecognized command line option ‘-mavx2’
> distcc[20379] ERROR: compile cpucycles.c on 10.1.1.1:3642 failed
> distcc[20379] (dcc_build_somewhere) Warning: remote compilation of 'cpucycles.c' failed, retrying locally
> distcc[20379] Warning: failed to distribute cpucycles.c to 10.1.1.1:3642, running locally instead
> gcc: error: unrecognized command line option ‘-Qunused-arguments’; did you mean ‘-Wunused-parameter’?
> gcc: error: unrecognized command line option ‘-mavx2’
> distcc[20379] ERROR: compile cpucycles.c on localhost failed
cpucycles/cpucycles.c compiler exited 1
cpucycles/ia64cpuinfo compiling gcc -fPIC -Wall -fomit-frame-pointer -fwrapv -O3
output
> distcc[5997] ERROR: compile cpucycles.c on 10.1.1.1:3642 failed
> distcc[5997] (dcc_build_somewhere) Warning: remote compilation of 'cpucycles.c' failed, retrying locally
> distcc[5997] Warning: failed to distribute cpucycles.c to 10.1.1.1:3642, running locally instead
> /tmp//ccpkjHUn.s: Assembler messages:
> /tmp//ccpkjHUn.s:12: Error: Illegal operands
> distcc[5997] ERROR: compile cpucycles.c on localhost failed
cpucycles/cpucycles.c compiler exited 1
cpucycles/ia64cpuinfo compiling gcc -fPIC -Wall -fomit-frame-pointer -fwrapv -march=core-avx2 -O3
output
> gcc: error: unrecognized command line option ‘-march=core-avx2’
> distcc[17118] ERROR: compile cpucycles.c on 10.1.1.1:3642 failed
> distcc[17118] (dcc_build_somewhere) Warning: remote compilation of 'cpucycles.c' failed, retrying locally
> distcc[17118] Warning: failed to distribute cpucycles.c to 10.1.1.1:3642, running locally instead
> gcc: error: unrecognized command line option ‘-march=core-avx2’
> distcc[17118] ERROR: compile cpucycles.c on localhost failed
cpucycles/cpucycles.c compiler exited 1
cpucycles/ia64cpuinfo compiling clang -fPIC -Wall -fomit-frame-pointer -fwrapv -Qunused-arguments -O3
output
> gcc: error: unrecognized command line option ‘-Qunused-arguments’; did you mean ‘-Wunused-parameter’?
> distcc[18808] ERROR: compile cpucycles.c on 10.1.1.1:3642 failed
> distcc[18808] (dcc_build_somewhere) Warning: remote compilation of 'cpucycles.c' failed, retrying locally
> distcc[18808] Warning: failed to distribute cpucycles.c to 10.1.1.1:3642, running locally instead
> gcc: error: unrecognized command line option ‘-Qunused-arguments’; did you mean ‘-Wunused-parameter’?
> distcc[18808] ERROR: compile cpucycles.c on localhost failed
cpucycles/cpucycles.c compiler exited 1
cpucycles/ia64cpuinfo compiling clang -fPIC -Wall -fomit-frame-pointer -fwrapv -Qunused-arguments -mavx2 -O3
output
> gcc: error: unrecognized command line option ‘-Qunused-arguments’; did you mean ‘-Wunused-parameter’?
> gcc: error: unrecognized command line option ‘-mavx2’
> distcc[23466] ERROR: compile cpucycles.c on 10.1.1.1:3642 failed
> distcc[23466] (dcc_build_somewhere) Warning: remote compilation of 'cpucycles.c' failed, retrying locally
> distcc[23466] Warning: failed to distribute cpucycles.c to 10.1.1.1:3642, running locally instead
> gcc: error: unrecognized command line option ‘-Qunused-arguments’; did you mean ‘-Wunused-parameter’?
> gcc: error: unrecognized command line option ‘-mavx2’
> distcc[23466] ERROR: compile cpucycles.c on localhost failed
cpucycles/cpucycles.c compiler exited 1
cpucycles/mips compiling gcc -fPIC -Wall -fomit-frame-pointer -fwrapv -O3
output
> distcc[267] ERROR: compile cpucycles.c on 10.1.1.1:3642 failed
> distcc[267] (dcc_build_somewhere) Warning: remote compilation of 'cpucycles.c' failed, retrying locally
> distcc[267] Warning: failed to distribute cpucycles.c to 10.1.1.1:3642, running locally instead
> cpucycles.c: In function ‘djbsort_cpucycles’:
> cpucycles.c:36:13: warning: pointer targets in passing argument 1 of ‘readticks’ differ in signedness [-Wpointer-sign]
>    readticks(now);
>              ^~~
> cpucycles.c:18:13: note: expected ‘unsigned int *’ but argument is of type ‘int *’
>  static void readticks(unsigned int *result)
>              ^~~~~~~~~
> cpucycles.c:22:3: error: unknown register name ‘$2’ in ‘asm’
>    asm volatile(".long 2080510011; move %0,$2" : "=r"(cc) : : "$2");
>    ^~~
> distcc[267] ERROR: compile cpucycles.c on localhost failed
cpucycles/cpucycles.c compiler exited 1
cpucycles/mips compiling gcc -fPIC -Wall -fomit-frame-pointer -fwrapv -march=core-avx2 -O3
output
> gcc: error: unrecognized command line option ‘-march=core-avx2’
> distcc[5570] ERROR: compile cpucycles.c on 10.1.1.1:3642 failed
> distcc[5570] (dcc_build_somewhere) Warning: remote compilation of 'cpucycles.c' failed, retrying locally
> distcc[5570] Warning: failed to distribute cpucycles.c to 10.1.1.1:3642, running locally instead
> gcc: error: unrecognized command line option ‘-march=core-avx2’
> distcc[5570] ERROR: compile cpucycles.c on localhost failed
cpucycles/cpucycles.c compiler exited 1
cpucycles/mips compiling clang -fPIC -Wall -fomit-frame-pointer -fwrapv -Qunused-arguments -O3
output
> gcc: error: unrecognized command line option ‘-Qunused-arguments’; did you mean ‘-Wunused-parameter’?
> distcc[1274] ERROR: compile cpucycles.c on 10.1.1.1:3642 failed
> distcc[1274] (dcc_build_somewhere) Warning: remote compilation of 'cpucycles.c' failed, retrying locally
> distcc[1274] Warning: failed to distribute cpucycles.c to 10.1.1.1:3642, running locally instead
> gcc: error: unrecognized command line option ‘-Qunused-arguments’; did you mean ‘-Wunused-parameter’?
> distcc[1274] ERROR: compile cpucycles.c on localhost failed
cpucycles/cpucycles.c compiler exited 1
cpucycles/mips compiling clang -fPIC -Wall -fomit-frame-pointer -fwrapv -Qunused-arguments -mavx2 -O3
output
> gcc: error: unrecognized command line option ‘-Qunused-arguments’; did you mean ‘-Wunused-parameter’?
> gcc: error: unrecognized command line option ‘-mavx2’
> distcc[7065] ERROR: compile cpucycles.c on 10.1.1.1:3642 failed
> distcc[7065] (dcc_build_somewhere) Warning: remote compilation of 'cpucycles.c' failed, retrying locally
> distcc[7065] Warning: failed to distribute cpucycles.c to 10.1.1.1:3642, running locally instead
> gcc: error: unrecognized command line option ‘-Qunused-arguments’; did you mean ‘-Wunused-parameter’?
> gcc: error: unrecognized command line option ‘-mavx2’
> distcc[7065] ERROR: compile cpucycles.c on localhost failed
cpucycles/cpucycles.c compiler exited 1
cpucycles/monotonic compiling gcc -fPIC -Wall -fomit-frame-pointer -fwrapv -O3
cpucycles warning: namespace violation: cpucycles.o __sparc_get_pc_thunk.l7 W djbsort_cpucycles_priv___sparc_get_pc_thunk.l7
cpucycles/monotonic compiling gcc -fPIC -Wall -fomit-frame-pointer -fwrapv -march=core-avx2 -O3
output
> gcc: error: unrecognized command line option ‘-march=core-avx2’
> distcc[12765] ERROR: compile cpucycles.c on 10.1.1.1:3642 failed
> distcc[12765] (dcc_build_somewhere) Warning: remote compilation of 'cpucycles.c' failed, retrying locally
> distcc[12765] Warning: failed to distribute cpucycles.c to 10.1.1.1:3642, running locally instead
> gcc: error: unrecognized command line option ‘-march=core-avx2’
> distcc[12765] ERROR: compile cpucycles.c on localhost failed
cpucycles/cpucycles.c compiler exited 1
cpucycles/monotonic compiling clang -fPIC -Wall -fomit-frame-pointer -fwrapv -Qunused-arguments -O3
output
> gcc: error: unrecognized command line option ‘-Qunused-arguments’; did you mean ‘-Wunused-parameter’?
> distcc[11137] ERROR: compile cpucycles.c on 10.1.1.1:3642 failed
> distcc[11137] (dcc_build_somewhere) Warning: remote compilation of 'cpucycles.c' failed, retrying locally
> distcc[11137] Warning: failed to distribute cpucycles.c to 10.1.1.1:3642, running locally instead
> gcc: error: unrecognized command line option ‘-Qunused-arguments’; did you mean ‘-Wunused-parameter’?
> distcc[11137] ERROR: compile cpucycles.c on localhost failed
cpucycles/cpucycles.c compiler exited 1
cpucycles/monotonic compiling clang -fPIC -Wall -fomit-frame-pointer -fwrapv -Qunused-arguments -mavx2 -O3
output
> gcc: error: unrecognized command line option ‘-Qunused-arguments’; did you mean ‘-Wunused-parameter’?
> gcc: error: unrecognized command line option ‘-mavx2’
> distcc[16534] ERROR: compile cpucycles.c on 10.1.1.1:3642 failed
> distcc[16534] (dcc_build_somewhere) Warning: remote compilation of 'cpucycles.c' failed, retrying locally
> distcc[16534] Warning: failed to distribute cpucycles.c to 10.1.1.1:3642, running locally instead
> gcc: error: unrecognized command line option ‘-Qunused-arguments’; did you mean ‘-Wunused-parameter’?
> gcc: error: unrecognized command line option ‘-mavx2’
> distcc[16534] ERROR: compile cpucycles.c on localhost failed
cpucycles/cpucycles.c compiler exited 1
cpucycles/monotoniccpuinfo compiling gcc -fPIC -Wall -fomit-frame-pointer -fwrapv -O3
cpucycles warning: namespace violation: cpucycles.o __sparc_get_pc_thunk.l7 W djbsort_cpucycles_priv___sparc_get_pc_thunk.l7
cpucycles/monotoniccpuinfo compiling gcc -fPIC -Wall -fomit-frame-pointer -fwrapv -march=core-avx2 -O3
output
> gcc: error: unrecognized command line option ‘-march=core-avx2’
> distcc[29410] ERROR: compile cpucycles.c on 10.1.1.1:3642 failed
> distcc[29410] (dcc_build_somewhere) Warning: remote compilation of 'cpucycles.c' failed, retrying locally
> distcc[29410] Warning: failed to distribute cpucycles.c to 10.1.1.1:3642, running locally instead
> gcc: error: unrecognized command line option ‘-march=core-avx2’
> distcc[29410] ERROR: compile cpucycles.c on localhost failed
cpucycles/cpucycles.c compiler exited 1
cpucycles/monotoniccpuinfo compiling clang -fPIC -Wall -fomit-frame-pointer -fwrapv -Qunused-arguments -O3
output
> gcc: error: unrecognized command line option ‘-Qunused-arguments’; did you mean ‘-Wunused-parameter’?
> distcc[23075] ERROR: compile cpucycles.c on 10.1.1.1:3642 failed
> distcc[23075] (dcc_build_somewhere) Warning: remote compilation of 'cpucycles.c' failed, retrying locally
> distcc[23075] Warning: failed to distribute cpucycles.c to 10.1.1.1:3642, running locally instead
> gcc: error: unrecognized command line option ‘-Qunused-arguments’; did you mean ‘-Wunused-parameter’?
> distcc[23075] ERROR: compile cpucycles.c on localhost failed
cpucycles/cpucycles.c compiler exited 1
cpucycles/monotoniccpuinfo compiling clang -fPIC -Wall -fomit-frame-pointer -fwrapv -Qunused-arguments -mavx2 -O3
output
> gcc: error: unrecognized command line option ‘-Qunused-arguments’; did you mean ‘-Wunused-parameter’?
> gcc: error: unrecognized command line option ‘-mavx2’
> distcc[14085] ERROR: compile cpucycles.c on 10.1.1.1:3642 failed
> distcc[14085] (dcc_build_somewhere) Warning: remote compilation of 'cpucycles.c' failed, retrying locally
> distcc[14085] Warning: failed to distribute cpucycles.c to 10.1.1.1:3642, running locally instead
> gcc: error: unrecognized command line option ‘-Qunused-arguments’; did you mean ‘-Wunused-parameter’?
> gcc: error: unrecognized command line option ‘-mavx2’
> distcc[14085] ERROR: compile cpucycles.c on localhost failed
cpucycles/cpucycles.c compiler exited 1
cpucycles/perfevent compiling gcc -fPIC -Wall -fomit-frame-pointer -fwrapv -O3
output
> cpucycles.c:6:10: fatal error: linux/perf_event.h: No such file or directory
>  #include <linux/perf_event.h>
>           ^~~~~~~~~~~~~~~~~~~~
> compilation terminated.
> distcc[7937] ERROR: compile cpucycles.c on 10.1.1.1:3642 failed
> distcc[7937] (dcc_build_somewhere) Warning: remote compilation of 'cpucycles.c' failed, retrying locally
> distcc[7937] Warning: failed to distribute cpucycles.c to 10.1.1.1:3642, running locally instead
> cpucycles.c:6:10: fatal error: linux/perf_event.h: No such file or directory
>  #include <linux/perf_event.h>
>           ^~~~~~~~~~~~~~~~~~~~
> compilation terminated.
> distcc[7937] ERROR: compile cpucycles.c on localhost failed
cpucycles/cpucycles.c compiler exited 1
cpucycles/perfevent compiling gcc -fPIC -Wall -fomit-frame-pointer -fwrapv -march=core-avx2 -O3
output
> gcc: error: unrecognized command line option ‘-march=core-avx2’
> distcc[13402] ERROR: compile cpucycles.c on 10.1.1.1:3642 failed
> distcc[13402] (dcc_build_somewhere) Warning: remote compilation of 'cpucycles.c' failed, retrying locally
> distcc[13402] Warning: failed to distribute cpucycles.c to 10.1.1.1:3642, running locally instead
> gcc: error: unrecognized command line option ‘-march=core-avx2’
> distcc[13402] ERROR: compile cpucycles.c on localhost failed
cpucycles/cpucycles.c compiler exited 1
cpucycles/perfevent compiling clang -fPIC -Wall -fomit-frame-pointer -fwrapv -Qunused-arguments -O3
output
> gcc: error: unrecognized command line option ‘-Qunused-arguments’; did you mean ‘-Wunused-parameter’?
> distcc[5884] ERROR: compile cpucycles.c on 10.1.1.1:3642 failed
> distcc[5884] (dcc_build_somewhere) Warning: remote compilation of 'cpucycles.c' failed, retrying locally
> distcc[5884] Warning: failed to distribute cpucycles.c to 10.1.1.1:3642, running locally instead
> gcc: error: unrecognized command line option ‘-Qunused-arguments’; did you mean ‘-Wunused-parameter’?
> distcc[5884] ERROR: compile cpucycles.c on localhost failed
cpucycles/cpucycles.c compiler exited 1
cpucycles/perfevent compiling clang -fPIC -Wall -fomit-frame-pointer -fwrapv -Qunused-arguments -mavx2 -O3
output
> gcc: error: unrecognized command line option ‘-Qunused-arguments’; did you mean ‘-Wunused-parameter’?
> gcc: error: unrecognized command line option ‘-mavx2’
> distcc[19640] ERROR: compile cpucycles.c on 10.1.1.1:3642 failed
> distcc[19640] (dcc_build_somewhere) Warning: remote compilation of 'cpucycles.c' failed, retrying locally
> distcc[19640] Warning: failed to distribute cpucycles.c to 10.1.1.1:3642, running locally instead
> gcc: error: unrecognized command line option ‘-Qunused-arguments’; did you mean ‘-Wunused-parameter’?
> gcc: error: unrecognized command line option ‘-mavx2’
> distcc[19640] ERROR: compile cpucycles.c on localhost failed
cpucycles/cpucycles.c compiler exited 1
cpucycles/powerpccpuinfo compiling gcc -fPIC -Wall -fomit-frame-pointer -fwrapv -O3
output
> distcc[5697] ERROR: compile cpucycles.c on 10.1.1.1:3642 failed
> distcc[5697] (dcc_build_somewhere) Warning: remote compilation of 'cpucycles.c' failed, retrying locally
> distcc[5697] Warning: failed to distribute cpucycles.c to 10.1.1.1:3642, running locally instead
> /tmp//ccp7VZN0.s: Assembler messages:
> /tmp//ccp7VZN0.s:447: Error: Unknown opcode: `mftbu'
> /tmp//ccp7VZN0.s:447: Error: Unknown opcode: `mftb'
> /tmp//ccp7VZN0.s:447: Error: Unknown opcode: `mftbu'
> /tmp//ccp7VZN0.s:472: Error: Unknown opcode: `mftbu'
> /tmp//ccp7VZN0.s:472: Error: Unknown opcode: `mftb'
> /tmp//ccp7VZN0.s:472: Error: Unknown opcode: `mftbu'
> /tmp//ccp7VZN0.s:572: Error: Unknown opcode: `mftbu'
> /tmp//ccp7VZN0.s:572: Error: Unknown opcode: `mftb'
> /tmp//ccp7VZN0.s:572: Error: Unknown opcode: `mftbu'
> distcc[5697] ERROR: compile cpucycles.c on localhost failed
cpucycles/cpucycles.c compiler exited 1
cpucycles/powerpccpuinfo compiling gcc -fPIC -Wall -fomit-frame-pointer -fwrapv -march=core-avx2 -O3
output
> gcc: error: unrecognized command line option ‘-march=core-avx2’
> distcc[27969] ERROR: compile cpucycles.c on 10.1.1.1:3642 failed
> distcc[27969] (dcc_build_somewhere) Warning: remote compilation of 'cpucycles.c' failed, retrying locally
> distcc[27969] Warning: failed to distribute cpucycles.c to 10.1.1.1:3642, running locally instead
> gcc: error: unrecognized command line option ‘-march=core-avx2’
> distcc[27969] ERROR: compile cpucycles.c on localhost failed
cpucycles/cpucycles.c compiler exited 1
cpucycles/powerpccpuinfo compiling clang -fPIC -Wall -fomit-frame-pointer -fwrapv -Qunused-arguments -O3
output
> gcc: error: unrecognized command line option ‘-Qunused-arguments’; did you mean ‘-Wunused-parameter’?
> distcc[12935] ERROR: compile cpucycles.c on 10.1.1.1:3642 failed
> distcc[12935] (dcc_build_somewhere) Warning: remote compilation of 'cpucycles.c' failed, retrying locally
> distcc[12935] Warning: failed to distribute cpucycles.c to 10.1.1.1:3642, running locally instead
> gcc: error: unrecognized command line option ‘-Qunused-arguments’; did you mean ‘-Wunused-parameter’?
> distcc[12935] ERROR: compile cpucycles.c on localhost failed
cpucycles/cpucycles.c compiler exited 1
cpucycles/powerpccpuinfo compiling clang -fPIC -Wall -fomit-frame-pointer -fwrapv -Qunused-arguments -mavx2 -O3
output
> gcc: error: unrecognized command line option ‘-Qunused-arguments’; did you mean ‘-Wunused-parameter’?
> gcc: error: unrecognized command line option ‘-mavx2’
> distcc[2703] ERROR: compile cpucycles.c on 10.1.1.1:3642 failed
> distcc[2703] (dcc_build_somewhere) Warning: remote compilation of 'cpucycles.c' failed, retrying locally
> distcc[2703] Warning: failed to distribute cpucycles.c to 10.1.1.1:3642, running locally instead
> gcc: error: unrecognized command line option ‘-Qunused-arguments’; did you mean ‘-Wunused-parameter’?
> gcc: error: unrecognized command line option ‘-mavx2’
> distcc[2703] ERROR: compile cpucycles.c on localhost failed
cpucycles/cpucycles.c compiler exited 1
cpucycles/powerpcmacos compiling gcc -fPIC -Wall -fomit-frame-pointer -fwrapv -O3
output
> cpucycles.c:3:10: fatal error: mach/mach_time.h: No such file or directory
>  #include <mach/mach_time.h>
>           ^~~~~~~~~~~~~~~~~~
> compilation terminated.
> distcc[13392] ERROR: compile cpucycles.c on 10.1.1.1:3642 failed
> distcc[13392] (dcc_build_somewhere) Warning: remote compilation of 'cpucycles.c' failed, retrying locally
> distcc[13392] Warning: failed to distribute cpucycles.c to 10.1.1.1:3642, running locally instead
> cpucycles.c:3:10: fatal error: mach/mach_time.h: No such file or directory
>  #include <mach/mach_time.h>
>           ^~~~~~~~~~~~~~~~~~
> compilation terminated.
> distcc[13392] ERROR: compile cpucycles.c on localhost failed
cpucycles/cpucycles.c compiler exited 1
cpucycles/powerpcmacos compiling gcc -fPIC -Wall -fomit-frame-pointer -fwrapv -march=core-avx2 -O3
output
> gcc: error: unrecognized command line option ‘-march=core-avx2’
> distcc[15840] ERROR: compile cpucycles.c on 10.1.1.1:3642 failed
> distcc[15840] (dcc_build_somewhere) Warning: remote compilation of 'cpucycles.c' failed, retrying locally
> distcc[15840] Warning: failed to distribute cpucycles.c to 10.1.1.1:3642, running locally instead
> gcc: error: unrecognized command line option ‘-march=core-avx2’
> distcc[15840] ERROR: compile cpucycles.c on localhost failed
cpucycles/cpucycles.c compiler exited 1
cpucycles/powerpcmacos compiling clang -fPIC -Wall -fomit-frame-pointer -fwrapv -Qunused-arguments -O3
output
> gcc: error: unrecognized command line option ‘-Qunused-arguments’; did you mean ‘-Wunused-parameter’?
> distcc[972] ERROR: compile cpucycles.c on 10.1.1.1:3642 failed
> distcc[972] (dcc_build_somewhere) Warning: remote compilation of 'cpucycles.c' failed, retrying locally
> distcc[972] Warning: failed to distribute cpucycles.c to 10.1.1.1:3642, running locally instead
> gcc: error: unrecognized command line option ‘-Qunused-arguments’; did you mean ‘-Wunused-parameter’?
> distcc[972] ERROR: compile cpucycles.c on localhost failed
cpucycles/cpucycles.c compiler exited 1
cpucycles/powerpcmacos compiling clang -fPIC -Wall -fomit-frame-pointer -fwrapv -Qunused-arguments -mavx2 -O3
output
> gcc: error: unrecognized command line option ‘-Qunused-arguments’; did you mean ‘-Wunused-parameter’?
> gcc: error: unrecognized command line option ‘-mavx2’
> distcc[17165] ERROR: compile cpucycles.c on 10.1.1.1:3642 failed
> distcc[17165] (dcc_build_somewhere) Warning: remote compilation of 'cpucycles.c' failed, retrying locally
> distcc[17165] Warning: failed to distribute cpucycles.c to 10.1.1.1:3642, running locally instead
> gcc: error: unrecognized command line option ‘-Qunused-arguments’; did you mean ‘-Wunused-parameter’?
> gcc: error: unrecognized command line option ‘-mavx2’
> distcc[17165] ERROR: compile cpucycles.c on localhost failed
cpucycles/cpucycles.c compiler exited 1
cpucycles/sparc32cpuinfo compiling gcc -fPIC -Wall -fomit-frame-pointer -fwrapv -O3
cpucycles warning: namespace violation: cpucycles.o __sparc_get_pc_thunk.l7 W djbsort_cpucycles_priv___sparc_get_pc_thunk.l7
cpucycles/sparc32cpuinfo compiling gcc -fPIC -Wall -fomit-frame-pointer -fwrapv -march=core-avx2 -O3
output
> gcc: error: unrecognized command line option ‘-march=core-avx2’
> distcc[28878] ERROR: compile cpucycles.c on 10.1.1.1:3642 failed
> distcc[28878] (dcc_build_somewhere) Warning: remote compilation of 'cpucycles.c' failed, retrying locally
> distcc[28878] Warning: failed to distribute cpucycles.c to 10.1.1.1:3642, running locally instead
> gcc: error: unrecognized command line option ‘-march=core-avx2’
> distcc[28878] ERROR: compile cpucycles.c on localhost failed
cpucycles/cpucycles.c compiler exited 1
cpucycles/sparc32cpuinfo compiling clang -fPIC -Wall -fomit-frame-pointer -fwrapv -Qunused-arguments -O3
output
> gcc: error: unrecognized command line option ‘-Qunused-arguments’; did you mean ‘-Wunused-parameter’?
> distcc[12495] ERROR: compile cpucycles.c on 10.1.1.1:3642 failed
> distcc[12495] (dcc_build_somewhere) Warning: remote compilation of 'cpucycles.c' failed, retrying locally
> distcc[12495] Warning: failed to distribute cpucycles.c to 10.1.1.1:3642, running locally instead
> gcc: error: unrecognized command line option ‘-Qunused-arguments’; did you mean ‘-Wunused-parameter’?
> distcc[12495] ERROR: compile cpucycles.c on localhost failed
cpucycles/cpucycles.c compiler exited 1
cpucycles/sparc32cpuinfo compiling clang -fPIC -Wall -fomit-frame-pointer -fwrapv -Qunused-arguments -mavx2 -O3
output
> gcc: error: unrecognized command line option ‘-Qunused-arguments’; did you mean ‘-Wunused-parameter’?
> gcc: error: unrecognized command line option ‘-mavx2’
> distcc[28536] ERROR: compile cpucycles.c on 10.1.1.1:3642 failed
> distcc[28536] (dcc_build_somewhere) Warning: remote compilation of 'cpucycles.c' failed, retrying locally
> distcc[28536] Warning: failed to distribute cpucycles.c to 10.1.1.1:3642, running locally instead
> gcc: error: unrecognized command line option ‘-Qunused-arguments’; did you mean ‘-Wunused-parameter’?
> gcc: error: unrecognized command line option ‘-mavx2’
> distcc[28536] ERROR: compile cpucycles.c on localhost failed
cpucycles/cpucycles.c compiler exited 1
cpucycles/sparccpuinfo compiling gcc -fPIC -Wall -fomit-frame-pointer -fwrapv -O3
cpucycles warning: namespace violation: cpucycles.o __sparc_get_pc_thunk.l7 W djbsort_cpucycles_priv___sparc_get_pc_thunk.l7
cpucycles/sparccpuinfo compiling gcc -fPIC -Wall -fomit-frame-pointer -fwrapv -march=core-avx2 -O3
output
> gcc: error: unrecognized command line option ‘-march=core-avx2’
> distcc[27374] ERROR: compile cpucycles.c on 10.1.1.1:3642 failed
> distcc[27374] (dcc_build_somewhere) Warning: remote compilation of 'cpucycles.c' failed, retrying locally
> distcc[27374] Warning: failed to distribute cpucycles.c to 10.1.1.1:3642, running locally instead
> gcc: error: unrecognized command line option ‘-march=core-avx2’
> distcc[27374] ERROR: compile cpucycles.c on localhost failed
cpucycles/cpucycles.c compiler exited 1
cpucycles/sparccpuinfo compiling clang -fPIC -Wall -fomit-frame-pointer -fwrapv -Qunused-arguments -O3
output
> gcc: error: unrecognized command line option ‘-Qunused-arguments’; did you mean ‘-Wunused-parameter’?
> distcc[3803] ERROR: compile cpucycles.c on 10.1.1.1:3642 failed
> distcc[3803] (dcc_build_somewhere) Warning: remote compilation of 'cpucycles.c' failed, retrying locally
> distcc[3803] Warning: failed to distribute cpucycles.c to 10.1.1.1:3642, running locally instead
> gcc: error: unrecognized command line option ‘-Qunused-arguments’; did you mean ‘-Wunused-parameter’?
> distcc[3803] ERROR: compile cpucycles.c on localhost failed
cpucycles/cpucycles.c compiler exited 1
cpucycles/sparccpuinfo compiling clang -fPIC -Wall -fomit-frame-pointer -fwrapv -Qunused-arguments -mavx2 -O3
output
> gcc: error: unrecognized command line option ‘-Qunused-arguments’; did you mean ‘-Wunused-parameter’?
> gcc: error: unrecognized command line option ‘-mavx2’
> distcc[18408] ERROR: compile cpucycles.c on 10.1.1.1:3642 failed
> distcc[18408] (dcc_build_somewhere) Warning: remote compilation of 'cpucycles.c' failed, retrying locally
> distcc[18408] Warning: failed to distribute cpucycles.c to 10.1.1.1:3642, running locally instead
> gcc: error: unrecognized command line option ‘-Qunused-arguments’; did you mean ‘-Wunused-parameter’?
> gcc: error: unrecognized command line option ‘-mavx2’
> distcc[18408] ERROR: compile cpucycles.c on localhost failed
cpucycles/cpucycles.c compiler exited 1
cpucycles/vct compiling gcc -fPIC -Wall -fomit-frame-pointer -fwrapv -O3
output
> distcc[24888] ERROR: compile cpucycles.c on 10.1.1.1:3642 failed
> distcc[24888] (dcc_build_somewhere) Warning: remote compilation of 'cpucycles.c' failed, retrying locally
> distcc[24888] Warning: failed to distribute cpucycles.c to 10.1.1.1:3642, running locally instead
> /tmp//cclMF1Pd.s: Assembler messages:
> /tmp//cclMF1Pd.s:452: Error: Unknown opcode: `mrs'
> /tmp//cclMF1Pd.s:511: Error: Unknown opcode: `mrs'
> /tmp//cclMF1Pd.s:523: Error: Unknown opcode: `mrs'
> /tmp//cclMF1Pd.s:561: Error: Unknown opcode: `mrs'
> /tmp//cclMF1Pd.s:574: Error: Unknown opcode: `mrs'
> /tmp//cclMF1Pd.s:785: Error: Unknown opcode: `mrs'
> /tmp//cclMF1Pd.s:797: Error: Unknown opcode: `mrs'
> /tmp//cclMF1Pd.s:835: Error: Unknown opcode: `mrs'
> /tmp//cclMF1Pd.s:848: Error: Unknown opcode: `mrs'
> distcc[24888] ERROR: compile cpucycles.c on localhost failed
cpucycles/cpucycles.c compiler exited 1
cpucycles/vct compiling gcc -fPIC -Wall -fomit-frame-pointer -fwrapv -march=core-avx2 -O3
output
> gcc: error: unrecognized command line option ‘-march=core-avx2’
> distcc[9927] ERROR: compile cpucycles.c on 10.1.1.1:3642 failed
> distcc[9927] (dcc_build_somewhere) Warning: remote compilation of 'cpucycles.c' failed, retrying locally
> distcc[9927] Warning: failed to distribute cpucycles.c to 10.1.1.1:3642, running locally instead
> gcc: error: unrecognized command line option ‘-march=core-avx2’
> distcc[9927] ERROR: compile cpucycles.c on localhost failed
cpucycles/cpucycles.c compiler exited 1
cpucycles/vct compiling clang -fPIC -Wall -fomit-frame-pointer -fwrapv -Qunused-arguments -O3
output
> gcc: error: unrecognized command line option ‘-Qunused-arguments’; did you mean ‘-Wunused-parameter’?
> distcc[17387] ERROR: compile cpucycles.c on 10.1.1.1:3642 failed
> distcc[17387] (dcc_build_somewhere) Warning: remote compilation of 'cpucycles.c' failed, retrying locally
> distcc[17387] Warning: failed to distribute cpucycles.c to 10.1.1.1:3642, running locally instead
> gcc: error: unrecognized command line option ‘-Qunused-arguments’; did you mean ‘-Wunused-parameter’?
> distcc[17387] ERROR: compile cpucycles.c on localhost failed
cpucycles/cpucycles.c compiler exited 1
cpucycles/vct compiling clang -fPIC -Wall -fomit-frame-pointer -fwrapv -Qunused-arguments -mavx2 -O3
output
> gcc: error: unrecognized command line option ‘-Qunused-arguments’; did you mean ‘-Wunused-parameter’?
> gcc: error: unrecognized command line option ‘-mavx2’
> distcc[14035] ERROR: compile cpucycles.c on 10.1.1.1:3642 failed
> distcc[14035] (dcc_build_somewhere) Warning: remote compilation of 'cpucycles.c' failed, retrying locally
> distcc[14035] Warning: failed to distribute cpucycles.c to 10.1.1.1:3642, running locally instead
> gcc: error: unrecognized command line option ‘-Qunused-arguments’; did you mean ‘-Wunused-parameter’?
> gcc: error: unrecognized command line option ‘-mavx2’
> distcc[14035] ERROR: compile cpucycles.c on localhost failed
cpucycles/cpucycles.c compiler exited 1
cpucycles/x86cpuinfo compiling gcc -fPIC -Wall -fomit-frame-pointer -fwrapv -O3
output
> distcc[18031] ERROR: compile cpucycles.c on 10.1.1.1:3642 failed
> distcc[18031] (dcc_build_somewhere) Warning: remote compilation of 'cpucycles.c' failed, retrying locally
> distcc[18031] Warning: failed to distribute cpucycles.c to 10.1.1.1:3642, running locally instead
> cpucycles.c: In function ‘djbsort_cpucycles’:
> cpucycles.c:10:3: error: output number 0 not directly addressable
>    asm volatile(".byte 15;.byte 49" : "=A" (result));
>    ^~~
> distcc[18031] ERROR: compile cpucycles.c on localhost failed
cpucycles/cpucycles.c compiler exited 1
cpucycles/x86cpuinfo compiling gcc -fPIC -Wall -fomit-frame-pointer -fwrapv -march=core-avx2 -O3
output
> gcc: error: unrecognized command line option ‘-march=core-avx2’
> distcc[2476] ERROR: compile cpucycles.c on 10.1.1.1:3642 failed
> distcc[2476] (dcc_build_somewhere) Warning: remote compilation of 'cpucycles.c' failed, retrying locally
> distcc[2476] Warning: failed to distribute cpucycles.c to 10.1.1.1:3642, running locally instead
> gcc: error: unrecognized command line option ‘-march=core-avx2’
> distcc[2476] ERROR: compile cpucycles.c on localhost failed
cpucycles/cpucycles.c compiler exited 1
cpucycles/x86cpuinfo compiling clang -fPIC -Wall -fomit-frame-pointer -fwrapv -Qunused-arguments -O3
output
> gcc: error: unrecognized command line option ‘-Qunused-arguments’; did you mean ‘-Wunused-parameter’?
> distcc[5815] ERROR: compile cpucycles.c on 10.1.1.1:3642 failed
> distcc[5815] (dcc_build_somewhere) Warning: remote compilation of 'cpucycles.c' failed, retrying locally
> distcc[5815] Warning: failed to distribute cpucycles.c to 10.1.1.1:3642, running locally instead
> gcc: error: unrecognized command line option ‘-Qunused-arguments’; did you mean ‘-Wunused-parameter’?
> distcc[5815] ERROR: compile cpucycles.c on localhost failed
cpucycles/cpucycles.c compiler exited 1
cpucycles/x86cpuinfo compiling clang -fPIC -Wall -fomit-frame-pointer -fwrapv -Qunused-arguments -mavx2 -O3
output
> gcc: error: unrecognized command line option ‘-Qunused-arguments’; did you mean ‘-Wunused-parameter’?
> gcc: error: unrecognized command line option ‘-mavx2’
> distcc[27749] ERROR: compile cpucycles.c on 10.1.1.1:3642 failed
> distcc[27749] (dcc_build_somewhere) Warning: remote compilation of 'cpucycles.c' failed, retrying locally
> distcc[27749] Warning: failed to distribute cpucycles.c to 10.1.1.1:3642, running locally instead
> gcc: error: unrecognized command line option ‘-Qunused-arguments’; did you mean ‘-Wunused-parameter’?
> gcc: error: unrecognized command line option ‘-mavx2’
> distcc[27749] ERROR: compile cpucycles.c on localhost failed
cpucycles/cpucycles.c compiler exited 1
cpucycles/x86cpuspeed compiling gcc -fPIC -Wall -fomit-frame-pointer -fwrapv -O3
output
> distcc[28380] ERROR: compile cpucycles.c on 10.1.1.1:3642 failed
> distcc[28380] (dcc_build_somewhere) Warning: remote compilation of 'cpucycles.c' failed, retrying locally
> distcc[28380] Warning: failed to distribute cpucycles.c to 10.1.1.1:3642, running locally instead
> cpucycles.c: In function ‘djbsort_cpucycles_persecond’:
> cpucycles.c:20:12: error: ‘HW_CPUSPEED’ undeclared (first use in this function); did you mean ‘LW_WSUSPEND’?
>    oid[1] = HW_CPUSPEED;
>             ^~~~~~~~~~~
>             LW_WSUSPEND
> cpucycles.c:20:12: note: each undeclared identifier is reported only once for each function it appears in
> distcc[28380] ERROR: compile cpucycles.c on localhost failed
cpucycles/cpucycles.c compiler exited 1
cpucycles/x86cpuspeed compiling gcc -fPIC -Wall -fomit-frame-pointer -fwrapv -march=core-avx2 -O3
output
> gcc: error: unrecognized command line option ‘-march=core-avx2’
> distcc[9888] ERROR: compile cpucycles.c on 10.1.1.1:3642 failed
> distcc[9888] (dcc_build_somewhere) Warning: remote compilation of 'cpucycles.c' failed, retrying locally
> distcc[9888] Warning: failed to distribute cpucycles.c to 10.1.1.1:3642, running locally instead
> gcc: error: unrecognized command line option ‘-march=core-avx2’
> distcc[9888] ERROR: compile cpucycles.c on localhost failed
cpucycles/cpucycles.c compiler exited 1
cpucycles/x86cpuspeed compiling clang -fPIC -Wall -fomit-frame-pointer -fwrapv -Qunused-arguments -O3
output
> gcc: error: unrecognized command line option ‘-Qunused-arguments’; did you mean ‘-Wunused-parameter’?
> distcc[26420] ERROR: compile cpucycles.c on 10.1.1.1:3642 failed
> distcc[26420] (dcc_build_somewhere) Warning: remote compilation of 'cpucycles.c' failed, retrying locally
> distcc[26420] Warning: failed to distribute cpucycles.c to 10.1.1.1:3642, running locally instead
> gcc: error: unrecognized command line option ‘-Qunused-arguments’; did you mean ‘-Wunused-parameter’?
> distcc[26420] ERROR: compile cpucycles.c on localhost failed
cpucycles/cpucycles.c compiler exited 1
cpucycles/x86cpuspeed compiling clang -fPIC -Wall -fomit-frame-pointer -fwrapv -Qunused-arguments -mavx2 -O3
output
> gcc: error: unrecognized command line option ‘-Qunused-arguments’; did you mean ‘-Wunused-parameter’?
> gcc: error: unrecognized command line option ‘-mavx2’
> distcc[19962] ERROR: compile cpucycles.c on 10.1.1.1:3642 failed
> distcc[19962] (dcc_build_somewhere) Warning: remote compilation of 'cpucycles.c' failed, retrying locally
> distcc[19962] Warning: failed to distribute cpucycles.c to 10.1.1.1:3642, running locally instead
> gcc: error: unrecognized command line option ‘-Qunused-arguments’; did you mean ‘-Wunused-parameter’?
> gcc: error: unrecognized command line option ‘-mavx2’
> distcc[19962] ERROR: compile cpucycles.c on localhost failed
cpucycles/cpucycles.c compiler exited 1
cpucycles/x86estimate compiling gcc -fPIC -Wall -fomit-frame-pointer -fwrapv -O3
output
> distcc[24239] ERROR: compile cpucycles.c on 10.1.1.1:3642 failed
> distcc[24239] (dcc_build_somewhere) Warning: remote compilation of 'cpucycles.c' failed, retrying locally
> distcc[24239] Warning: failed to distribute cpucycles.c to 10.1.1.1:3642, running locally instead
> cpucycles.c: In function ‘djbsort_cpucycles’:
> cpucycles.c:10:3: error: output number 0 not directly addressable
>    asm volatile(".byte 15;.byte 49" : "=A" (result));
>    ^~~
> distcc[24239] ERROR: compile cpucycles.c on localhost failed
cpucycles/cpucycles.c compiler exited 1
cpucycles/x86estimate compiling gcc -fPIC -Wall -fomit-frame-pointer -fwrapv -march=core-avx2 -O3
output
> gcc: error: unrecognized command line option ‘-march=core-avx2’
> distcc[16401] ERROR: compile cpucycles.c on 10.1.1.1:3642 failed
> distcc[16401] (dcc_build_somewhere) Warning: remote compilation of 'cpucycles.c' failed, retrying locally
> distcc[16401] Warning: failed to distribute cpucycles.c to 10.1.1.1:3642, running locally instead
> gcc: error: unrecognized command line option ‘-march=core-avx2’
> distcc[16401] ERROR: compile cpucycles.c on localhost failed
cpucycles/cpucycles.c compiler exited 1
cpucycles/x86estimate compiling clang -fPIC -Wall -fomit-frame-pointer -fwrapv -Qunused-arguments -O3
output
> gcc: error: unrecognized command line option ‘-Qunused-arguments’; did you mean ‘-Wunused-parameter’?
> distcc[1189] ERROR: compile cpucycles.c on 10.1.1.1:3642 failed
> distcc[1189] (dcc_build_somewhere) Warning: remote compilation of 'cpucycles.c' failed, retrying locally
> distcc[1189] Warning: failed to distribute cpucycles.c to 10.1.1.1:3642, running locally instead
> gcc: error: unrecognized command line option ‘-Qunused-arguments’; did you mean ‘-Wunused-parameter’?
> distcc[1189] ERROR: compile cpucycles.c on localhost failed
cpucycles/cpucycles.c compiler exited 1
cpucycles/x86estimate compiling clang -fPIC -Wall -fomit-frame-pointer -fwrapv -Qunused-arguments -mavx2 -O3
output
> gcc: error: unrecognized command line option ‘-Qunused-arguments’; did you mean ‘-Wunused-parameter’?
> gcc: error: unrecognized command line option ‘-mavx2’
> distcc[10379] ERROR: compile cpucycles.c on 10.1.1.1:3642 failed
> distcc[10379] (dcc_build_somewhere) Warning: remote compilation of 'cpucycles.c' failed, retrying locally
> distcc[10379] Warning: failed to distribute cpucycles.c to 10.1.1.1:3642, running locally instead
> gcc: error: unrecognized command line option ‘-Qunused-arguments’; did you mean ‘-Wunused-parameter’?
> gcc: error: unrecognized command line option ‘-mavx2’
> distcc[10379] ERROR: compile cpucycles.c on localhost failed
cpucycles/cpucycles.c compiler exited 1
cpucycles/x86tscfreq compiling gcc -fPIC -Wall -fomit-frame-pointer -fwrapv -O3
output
> distcc[14858] ERROR: compile cpucycles.c on 10.1.1.1:3642 failed
> distcc[14858] (dcc_build_somewhere) Warning: remote compilation of 'cpucycles.c' failed, retrying locally
> distcc[14858] Warning: failed to distribute cpucycles.c to 10.1.1.1:3642, running locally instead
> cpucycles.c: In function ‘djbsort_cpucycles’:
> cpucycles.c:8:3: error: output number 0 not directly addressable
>    asm volatile(".byte 15;.byte 49" : "=A" (result));
>    ^~~
> distcc[14858] ERROR: compile cpucycles.c on localhost failed
cpucycles/cpucycles.c compiler exited 1
cpucycles/x86tscfreq compiling gcc -fPIC -Wall -fomit-frame-pointer -fwrapv -march=core-avx2 -O3
output
> gcc: error: unrecognized command line option ‘-march=core-avx2’
> distcc[13257] ERROR: compile cpucycles.c on 10.1.1.1:3642 failed
> distcc[13257] (dcc_build_somewhere) Warning: remote compilation of 'cpucycles.c' failed, retrying locally
> distcc[13257] Warning: failed to distribute cpucycles.c to 10.1.1.1:3642, running locally instead
> gcc: error: unrecognized command line option ‘-march=core-avx2’
> distcc[13257] ERROR: compile cpucycles.c on localhost failed
cpucycles/cpucycles.c compiler exited 1
cpucycles/x86tscfreq compiling clang -fPIC -Wall -fomit-frame-pointer -fwrapv -Qunused-arguments -O3
output
> gcc: error: unrecognized command line option ‘-Qunused-arguments’; did you mean ‘-Wunused-parameter’?
> distcc[14328] ERROR: compile cpucycles.c on 10.1.1.1:3642 failed
> distcc[14328] (dcc_build_somewhere) Warning: remote compilation of 'cpucycles.c' failed, retrying locally
> distcc[14328] Warning: failed to distribute cpucycles.c to 10.1.1.1:3642, running locally instead
> gcc: error: unrecognized command line option ‘-Qunused-arguments’; did you mean ‘-Wunused-parameter’?
> distcc[14328] ERROR: compile cpucycles.c on localhost failed
cpucycles/cpucycles.c compiler exited 1
cpucycles/x86tscfreq compiling clang -fPIC -Wall -fomit-frame-pointer -fwrapv -Qunused-arguments -mavx2 -O3
output
> gcc: error: unrecognized command line option ‘-Qunused-arguments’; did you mean ‘-Wunused-parameter’?
> gcc: error: unrecognized command line option ‘-mavx2’
> distcc[13121] ERROR: compile cpucycles.c on 10.1.1.1:3642 failed
> distcc[13121] (dcc_build_somewhere) Warning: remote compilation of 'cpucycles.c' failed, retrying locally
> distcc[13121] Warning: failed to distribute cpucycles.c to 10.1.1.1:3642, running locally instead
> gcc: error: unrecognized command line option ‘-Qunused-arguments’; did you mean ‘-Wunused-parameter’?
> gcc: error: unrecognized command line option ‘-mavx2’
> distcc[13121] ERROR: compile cpucycles.c on localhost failed
cpucycles/cpucycles.c compiler exited 1
int32/avx2 compiling gcc -fPIC -Wall -fomit-frame-pointer -fwrapv -O3
int32/avx2/sort.c compiling
output
> sort.c:4:10: fatal error: immintrin.h: No such file or directory
>  #include <immintrin.h>
>           ^~~~~~~~~~~~~
> compilation terminated.
> distcc[21393] ERROR: compile sort.c on 10.1.1.1:3642 failed
> distcc[21393] (dcc_build_somewhere) Warning: remote compilation of 'sort.c' failed, retrying locally
> distcc[21393] Warning: failed to distribute sort.c to 10.1.1.1:3642, running locally instead
> sort.c:4:10: fatal error: immintrin.h: No such file or directory
>  #include <immintrin.h>
>           ^~~~~~~~~~~~~
> compilation terminated.
> distcc[21393] ERROR: compile sort.c on localhost failed
int32/avx2/sort.c compiler exited 1
int32/avx2/compiler.c compiling
int32/avx2/version.c compiling
int32/avx2/implementation.c compiling
int32/avx2/cycles.c compiling
int32/avx2/works.c compiling
int32/avx2 compiling gcc -fPIC -Wall -fomit-frame-pointer -fwrapv -march=core-avx2 -O3
int32/avx2/sort.c compiling
output
> gcc: error: unrecognized command line option ‘-march=core-avx2’
> distcc[1856] ERROR: compile sort.c on 10.1.1.1:3642 failed
> distcc[1856] (dcc_build_somewhere) Warning: remote compilation of 'sort.c' failed, retrying locally
> distcc[1856] Warning: failed to distribute sort.c to 10.1.1.1:3642, running locally instead
> gcc: error: unrecognized command line option ‘-march=core-avx2’
> distcc[1856] ERROR: compile sort.c on localhost failed
int32/avx2/sort.c compiler exited 1
int32/avx2/compiler.c compiling
output
> gcc: error: unrecognized command line option ‘-march=core-avx2’
> distcc[19661] ERROR: compile compiler.c on 10.1.1.1:3642 failed
> distcc[19661] (dcc_build_somewhere) Warning: remote compilation of 'compiler.c' failed, retrying locally
> distcc[19661] Warning: failed to distribute compiler.c to 10.1.1.1:3642, running locally instead
> gcc: error: unrecognized command line option ‘-march=core-avx2’
> distcc[19661] ERROR: compile compiler.c on localhost failed
int32/avx2/compiler.c compiler exited 1
int32/avx2/version.c compiling
output
> gcc: error: unrecognized command line option ‘-march=core-avx2’
> distcc[12727] ERROR: compile version.c on 10.1.1.1:3642 failed
> distcc[12727] (dcc_build_somewhere) Warning: remote compilation of 'version.c' failed, retrying locally
> distcc[12727] Warning: failed to distribute version.c to 10.1.1.1:3642, running locally instead
> gcc: error: unrecognized command line option ‘-march=core-avx2’
> distcc[12727] ERROR: compile version.c on localhost failed
int32/avx2/version.c compiler exited 1
int32/avx2/implementation.c compiling
output
> gcc: error: unrecognized command line option ‘-march=core-avx2’
> distcc[3927] ERROR: compile implementation.c on 10.1.1.1:3642 failed
> distcc[3927] (dcc_build_somewhere) Warning: remote compilation of 'implementation.c' failed, retrying locally
> distcc[3927] Warning: failed to distribute implementation.c to 10.1.1.1:3642, running locally instead
> gcc: error: unrecognized command line option ‘-march=core-avx2’
> distcc[3927] ERROR: compile implementation.c on localhost failed
int32/avx2/implementation.c compiler exited 1
int32/avx2/cycles.c compiling
output
> gcc: error: unrecognized command line option ‘-march=core-avx2’
> distcc[15065] ERROR: compile cycles.c on 10.1.1.1:3642 failed
> distcc[15065] (dcc_build_somewhere) Warning: remote compilation of 'cycles.c' failed, retrying locally
> distcc[15065] Warning: failed to distribute cycles.c to 10.1.1.1:3642, running locally instead
> gcc: error: unrecognized command line option ‘-march=core-avx2’
> distcc[15065] ERROR: compile cycles.c on localhost failed
int32/avx2/cycles.c compiler exited 1
int32/avx2/works.c compiling
output
> gcc: error: unrecognized command line option ‘-march=core-avx2’
> distcc[12462] ERROR: compile works.c on 10.1.1.1:3642 failed
> distcc[12462] (dcc_build_somewhere) Warning: remote compilation of 'works.c' failed, retrying locally
> distcc[12462] Warning: failed to distribute works.c to 10.1.1.1:3642, running locally instead
> gcc: error: unrecognized command line option ‘-march=core-avx2’
> distcc[12462] ERROR: compile works.c on localhost failed
int32/avx2/works.c compiler exited 1
int32/avx2 compiling clang -fPIC -Wall -fomit-frame-pointer -fwrapv -Qunused-arguments -O3
int32/avx2/sort.c compiling
output
> gcc: error: unrecognized command line option ‘-Qunused-arguments’; did you mean ‘-Wunused-parameter’?
> distcc[20989] ERROR: compile sort.c on 10.1.1.1:3642 failed
> distcc[20989] (dcc_build_somewhere) Warning: remote compilation of 'sort.c' failed, retrying locally
> distcc[20989] Warning: failed to distribute sort.c to 10.1.1.1:3642, running locally instead
> gcc: error: unrecognized command line option ‘-Qunused-arguments’; did you mean ‘-Wunused-parameter’?
> distcc[20989] ERROR: compile sort.c on localhost failed
int32/avx2/sort.c compiler exited 1
int32/avx2/compiler.c compiling
output
> gcc: error: unrecognized command line option ‘-Qunused-arguments’; did you mean ‘-Wunused-parameter’?
> distcc[22313] ERROR: compile compiler.c on 10.1.1.1:3642 failed
> distcc[22313] (dcc_build_somewhere) Warning: remote compilation of 'compiler.c' failed, retrying locally
> distcc[22313] Warning: failed to distribute compiler.c to 10.1.1.1:3642, running locally instead
> gcc: error: unrecognized command line option ‘-Qunused-arguments’; did you mean ‘-Wunused-parameter’?
> distcc[22313] ERROR: compile compiler.c on localhost failed
int32/avx2/compiler.c compiler exited 1
int32/avx2/version.c compiling
output
> gcc: error: unrecognized command line option ‘-Qunused-arguments’; did you mean ‘-Wunused-parameter’?
> distcc[7442] ERROR: compile version.c on 10.1.1.1:3642 failed
> distcc[7442] (dcc_build_somewhere) Warning: remote compilation of 'version.c' failed, retrying locally
> distcc[7442] Warning: failed to distribute version.c to 10.1.1.1:3642, running locally instead
> gcc: error: unrecognized command line option ‘-Qunused-arguments’; did you mean ‘-Wunused-parameter’?
> distcc[7442] ERROR: compile version.c on localhost failed
int32/avx2/version.c compiler exited 1
int32/avx2/implementation.c compiling
output
> gcc: error: unrecognized command line option ‘-Qunused-arguments’; did you mean ‘-Wunused-parameter’?
> distcc[12423] ERROR: compile implementation.c on 10.1.1.1:3642 failed
> distcc[12423] (dcc_build_somewhere) Warning: remote compilation of 'implementation.c' failed, retrying locally
> distcc[12423] Warning: failed to distribute implementation.c to 10.1.1.1:3642, running locally instead
> gcc: error: unrecognized command line option ‘-Qunused-arguments’; did you mean ‘-Wunused-parameter’?
> distcc[12423] ERROR: compile implementation.c on localhost failed
int32/avx2/implementation.c compiler exited 1
int32/avx2/cycles.c compiling
output
> gcc: error: unrecognized command line option ‘-Qunused-arguments’; did you mean ‘-Wunused-parameter’?
> distcc[17374] ERROR: compile cycles.c on 10.1.1.1:3642 failed
> distcc[17374] (dcc_build_somewhere) Warning: remote compilation of 'cycles.c' failed, retrying locally
> distcc[17374] Warning: failed to distribute cycles.c to 10.1.1.1:3642, running locally instead
> gcc: error: unrecognized command line option ‘-Qunused-arguments’; did you mean ‘-Wunused-parameter’?
> distcc[17374] ERROR: compile cycles.c on localhost failed
int32/avx2/cycles.c compiler exited 1
int32/avx2/works.c compiling
output
> gcc: error: unrecognized command line option ‘-Qunused-arguments’; did you mean ‘-Wunused-parameter’?
> distcc[14108] ERROR: compile works.c on 10.1.1.1:3642 failed
> distcc[14108] (dcc_build_somewhere) Warning: remote compilation of 'works.c' failed, retrying locally
> distcc[14108] Warning: failed to distribute works.c to 10.1.1.1:3642, running locally instead
> gcc: error: unrecognized command line option ‘-Qunused-arguments’; did you mean ‘-Wunused-parameter’?
> distcc[14108] ERROR: compile works.c on localhost failed
int32/avx2/works.c compiler exited 1
int32/avx2 compiling clang -fPIC -Wall -fomit-frame-pointer -fwrapv -Qunused-arguments -mavx2 -O3
int32/avx2/sort.c compiling
output
> gcc: error: unrecognized command line option ‘-Qunused-arguments’; did you mean ‘-Wunused-parameter’?
> gcc: error: unrecognized command line option ‘-mavx2’
> distcc[9125] ERROR: compile sort.c on 10.1.1.1:3642 failed
> distcc[9125] (dcc_build_somewhere) Warning: remote compilation of 'sort.c' failed, retrying locally
> distcc[9125] Warning: failed to distribute sort.c to 10.1.1.1:3642, running locally instead
> gcc: error: unrecognized command line option ‘-Qunused-arguments’; did you mean ‘-Wunused-parameter’?
> gcc: error: unrecognized command line option ‘-mavx2’
> distcc[9125] ERROR: compile sort.c on localhost failed
int32/avx2/sort.c compiler exited 1
int32/avx2/compiler.c compiling
output
> gcc: error: unrecognized command line option ‘-Qunused-arguments’; did you mean ‘-Wunused-parameter’?
> gcc: error: unrecognized command line option ‘-mavx2’
> distcc[16214] ERROR: compile compiler.c on 10.1.1.1:3642 failed
> distcc[16214] (dcc_build_somewhere) Warning: remote compilation of 'compiler.c' failed, retrying locally
> distcc[16214] Warning: failed to distribute compiler.c to 10.1.1.1:3642, running locally instead
> gcc: error: unrecognized command line option ‘-Qunused-arguments’; did you mean ‘-Wunused-parameter’?
> gcc: error: unrecognized command line option ‘-mavx2’
> distcc[16214] ERROR: compile compiler.c on localhost failed
int32/avx2/compiler.c compiler exited 1
int32/avx2/version.c compiling
output
> gcc: error: unrecognized command line option ‘-Qunused-arguments’; did you mean ‘-Wunused-parameter’?
> gcc: error: unrecognized command line option ‘-mavx2’
> distcc[3049] ERROR: compile version.c on 10.1.1.1:3642 failed
> distcc[3049] (dcc_build_somewhere) Warning: remote compilation of 'version.c' failed, retrying locally
> distcc[3049] Warning: failed to distribute version.c to 10.1.1.1:3642, running locally instead
> gcc: error: unrecognized command line option ‘-Qunused-arguments’; did you mean ‘-Wunused-parameter’?
> gcc: error: unrecognized command line option ‘-mavx2’
> distcc[3049] ERROR: compile version.c on localhost failed
int32/avx2/version.c compiler exited 1
int32/avx2/implementation.c compiling
output
> gcc: error: unrecognized command line option ‘-Qunused-arguments’; did you mean ‘-Wunused-parameter’?
> gcc: error: unrecognized command line option ‘-mavx2’
> distcc[3505] ERROR: compile implementation.c on 10.1.1.1:3642 failed
> distcc[3505] (dcc_build_somewhere) Warning: remote compilation of 'implementation.c' failed, retrying locally
> distcc[3505] Warning: failed to distribute implementation.c to 10.1.1.1:3642, running locally instead
> gcc: error: unrecognized command line option ‘-Qunused-arguments’; did you mean ‘-Wunused-parameter’?
> gcc: error: unrecognized command line option ‘-mavx2’
> distcc[3505] ERROR: compile implementation.c on localhost failed
int32/avx2/implementation.c compiler exited 1
int32/avx2/cycles.c compiling
output
> gcc: error: unrecognized command line option ‘-Qunused-arguments’; did you mean ‘-Wunused-parameter’?
> gcc: error: unrecognized command line option ‘-mavx2’
> distcc[846] ERROR: compile cycles.c on 10.1.1.1:3642 failed
> distcc[846] (dcc_build_somewhere) Warning: remote compilation of 'cycles.c' failed, retrying locally
> distcc[846] Warning: failed to distribute cycles.c to 10.1.1.1:3642, running locally instead
> gcc: error: unrecognized command line option ‘-Qunused-arguments’; did you mean ‘-Wunused-parameter’?
> gcc: error: unrecognized command line option ‘-mavx2’
> distcc[846] ERROR: compile cycles.c on localhost failed
int32/avx2/cycles.c compiler exited 1
int32/avx2/works.c compiling
output
> gcc: error: unrecognized command line option ‘-Qunused-arguments’; did you mean ‘-Wunused-parameter’?
> gcc: error: unrecognized command line option ‘-mavx2’
> distcc[18370] ERROR: compile works.c on 10.1.1.1:3642 failed
> distcc[18370] (dcc_build_somewhere) Warning: remote compilation of 'works.c' failed, retrying locally
> distcc[18370] Warning: failed to distribute works.c to 10.1.1.1:3642, running locally instead
> gcc: error: unrecognized command line option ‘-Qunused-arguments’; did you mean ‘-Wunused-parameter’?
> gcc: error: unrecognized command line option ‘-mavx2’
> distcc[18370] ERROR: compile works.c on localhost failed
int32/avx2/works.c compiler exited 1
int32/portable3 compiling gcc -fPIC -Wall -fomit-frame-pointer -fwrapv -O3
int32/portable3/sort.c compiling
int32/portable3/compiler.c compiling
int32/portable3/version.c compiling
int32/portable3/implementation.c compiling
int32/portable3/cycles.c compiling
int32/portable3/works.c compiling
int32/portable3 compiled gcc -fPIC -Wall -fomit-frame-pointer -fwrapv -O3
int32/portable3 warning: namespace violation: sort.o __sparc_get_pc_thunk.l7 W djbsort_int32_priv___sparc_get_pc_thunk.l7
int32/portable3 compiling gcc -fPIC -Wall -fomit-frame-pointer -fwrapv -march=core-avx2 -O3
int32/portable3/sort.c compiling
output
> gcc: error: unrecognized command line option ‘-march=core-avx2’
> distcc[8784] ERROR: compile sort.c on 10.1.1.1:3642 failed
> distcc[8784] (dcc_build_somewhere) Warning: remote compilation of 'sort.c' failed, retrying locally
> distcc[8784] Warning: failed to distribute sort.c to 10.1.1.1:3642, running locally instead
> gcc: error: unrecognized command line option ‘-march=core-avx2’
> distcc[8784] ERROR: compile sort.c on localhost failed
int32/portable3/sort.c compiler exited 1
int32/portable3/compiler.c compiling
output
> gcc: error: unrecognized command line option ‘-march=core-avx2’
> distcc[27632] ERROR: compile compiler.c on 10.1.1.1:3642 failed
> distcc[27632] (dcc_build_somewhere) Warning: remote compilation of 'compiler.c' failed, retrying locally
> distcc[27632] Warning: failed to distribute compiler.c to 10.1.1.1:3642, running locally instead
> gcc: error: unrecognized command line option ‘-march=core-avx2’
> distcc[27632] ERROR: compile compiler.c on localhost failed
int32/portable3/compiler.c compiler exited 1
int32/portable3/version.c compiling
output
> gcc: error: unrecognized command line option ‘-march=core-avx2’
> distcc[15845] ERROR: compile version.c on 10.1.1.1:3642 failed
> distcc[15845] (dcc_build_somewhere) Warning: remote compilation of 'version.c' failed, retrying locally
> distcc[15845] Warning: failed to distribute version.c to 10.1.1.1:3642, running locally instead
> gcc: error: unrecognized command line option ‘-march=core-avx2’
> distcc[15845] ERROR: compile version.c on localhost failed
int32/portable3/version.c compiler exited 1
int32/portable3/implementation.c compiling
output
> gcc: error: unrecognized command line option ‘-march=core-avx2’
> distcc[10656] ERROR: compile implementation.c on 10.1.1.1:3642 failed
> distcc[10656] (dcc_build_somewhere) Warning: remote compilation of 'implementation.c' failed, retrying locally
> distcc[10656] Warning: failed to distribute implementation.c to 10.1.1.1:3642, running locally instead
> gcc: error: unrecognized command line option ‘-march=core-avx2’
> distcc[10656] ERROR: compile implementation.c on localhost failed
int32/portable3/implementation.c compiler exited 1
int32/portable3/cycles.c compiling
output
> gcc: error: unrecognized command line option ‘-march=core-avx2’
> distcc[8968] ERROR: compile cycles.c on 10.1.1.1:3642 failed
> distcc[8968] (dcc_build_somewhere) Warning: remote compilation of 'cycles.c' failed, retrying locally
> distcc[8968] Warning: failed to distribute cycles.c to 10.1.1.1:3642, running locally instead
> gcc: error: unrecognized command line option ‘-march=core-avx2’
> distcc[8968] ERROR: compile cycles.c on localhost failed
int32/portable3/cycles.c compiler exited 1
int32/portable3/works.c compiling
output
> gcc: error: unrecognized command line option ‘-march=core-avx2’
> distcc[11868] ERROR: compile works.c on 10.1.1.1:3642 failed
> distcc[11868] (dcc_build_somewhere) Warning: remote compilation of 'works.c' failed, retrying locally
> distcc[11868] Warning: failed to distribute works.c to 10.1.1.1:3642, running locally instead
> gcc: error: unrecognized command line option ‘-march=core-avx2’
> distcc[11868] ERROR: compile works.c on localhost failed
int32/portable3/works.c compiler exited 1
int32/portable3 compiling clang -fPIC -Wall -fomit-frame-pointer -fwrapv -Qunused-arguments -O3
int32/portable3/sort.c compiling
output
> gcc: error: unrecognized command line option ‘-Qunused-arguments’; did you mean ‘-Wunused-parameter’?
> distcc[15956] ERROR: compile sort.c on 10.1.1.1:3642 failed
> distcc[15956] (dcc_build_somewhere) Warning: remote compilation of 'sort.c' failed, retrying locally
> distcc[15956] Warning: failed to distribute sort.c to 10.1.1.1:3642, running locally instead
> gcc: error: unrecognized command line option ‘-Qunused-arguments’; did you mean ‘-Wunused-parameter’?
> distcc[15956] ERROR: compile sort.c on localhost failed
int32/portable3/sort.c compiler exited 1
int32/portable3/compiler.c compiling
output
> gcc: error: unrecognized command line option ‘-Qunused-arguments’; did you mean ‘-Wunused-parameter’?
> distcc[20514] ERROR: compile compiler.c on 10.1.1.1:3642 failed
> distcc[20514] (dcc_build_somewhere) Warning: remote compilation of 'compiler.c' failed, retrying locally
> distcc[20514] Warning: failed to distribute compiler.c to 10.1.1.1:3642, running locally instead
> gcc: error: unrecognized command line option ‘-Qunused-arguments’; did you mean ‘-Wunused-parameter’?
> distcc[20514] ERROR: compile compiler.c on localhost failed
int32/portable3/compiler.c compiler exited 1
int32/portable3/version.c compiling
output
> gcc: error: unrecognized command line option ‘-Qunused-arguments’; did you mean ‘-Wunused-parameter’?
> distcc[25452] ERROR: compile version.c on 10.1.1.1:3642 failed
> distcc[25452] (dcc_build_somewhere) Warning: remote compilation of 'version.c' failed, retrying locally
> distcc[25452] Warning: failed to distribute version.c to 10.1.1.1:3642, running locally instead
> gcc: error: unrecognized command line option ‘-Qunused-arguments’; did you mean ‘-Wunused-parameter’?
> distcc[25452] ERROR: compile version.c on localhost failed
int32/portable3/version.c compiler exited 1
int32/portable3/implementation.c compiling
output
> gcc: error: unrecognized command line option ‘-Qunused-arguments’; did you mean ‘-Wunused-parameter’?
> distcc[22099] ERROR: compile implementation.c on 10.1.1.1:3642 failed
> distcc[22099] (dcc_build_somewhere) Warning: remote compilation of 'implementation.c' failed, retrying locally
> distcc[22099] Warning: failed to distribute implementation.c to 10.1.1.1:3642, running locally instead
> gcc: error: unrecognized command line option ‘-Qunused-arguments’; did you mean ‘-Wunused-parameter’?
> distcc[22099] ERROR: compile implementation.c on localhost failed
int32/portable3/implementation.c compiler exited 1
int32/portable3/cycles.c compiling
output
> gcc: error: unrecognized command line option ‘-Qunused-arguments’; did you mean ‘-Wunused-parameter’?
> distcc[29802] ERROR: compile cycles.c on 10.1.1.1:3642 failed
> distcc[29802] (dcc_build_somewhere) Warning: remote compilation of 'cycles.c' failed, retrying locally
> distcc[29802] Warning: failed to distribute cycles.c to 10.1.1.1:3642, running locally instead
> gcc: error: unrecognized command line option ‘-Qunused-arguments’; did you mean ‘-Wunused-parameter’?
> distcc[29802] ERROR: compile cycles.c on localhost failed
int32/portable3/cycles.c compiler exited 1
int32/portable3/works.c compiling
output
> gcc: error: unrecognized command line option ‘-Qunused-arguments’; did you mean ‘-Wunused-parameter’?
> distcc[12451] ERROR: compile works.c on 10.1.1.1:3642 failed
> distcc[12451] (dcc_build_somewhere) Warning: remote compilation of 'works.c' failed, retrying locally
> distcc[12451] Warning: failed to distribute works.c to 10.1.1.1:3642, running locally instead
> gcc: error: unrecognized command line option ‘-Qunused-arguments’; did you mean ‘-Wunused-parameter’?
> distcc[12451] ERROR: compile works.c on localhost failed
int32/portable3/works.c compiler exited 1
int32/portable3 compiling clang -fPIC -Wall -fomit-frame-pointer -fwrapv -Qunused-arguments -mavx2 -O3
int32/portable3/sort.c compiling
output
> gcc: error: unrecognized command line option ‘-Qunused-arguments’; did you mean ‘-Wunused-parameter’?
> gcc: error: unrecognized command line option ‘-mavx2’
> distcc[19077] ERROR: compile sort.c on 10.1.1.1:3642 failed
> distcc[19077] (dcc_build_somewhere) Warning: remote compilation of 'sort.c' failed, retrying locally
> distcc[19077] Warning: failed to distribute sort.c to 10.1.1.1:3642, running locally instead
> gcc: error: unrecognized command line option ‘-Qunused-arguments’; did you mean ‘-Wunused-parameter’?
> gcc: error: unrecognized command line option ‘-mavx2’
> distcc[19077] ERROR: compile sort.c on localhost failed
int32/portable3/sort.c compiler exited 1
int32/portable3/compiler.c compiling
output
> gcc: error: unrecognized command line option ‘-Qunused-arguments’; did you mean ‘-Wunused-parameter’?
> gcc: error: unrecognized command line option ‘-mavx2’
> distcc[25525] ERROR: compile compiler.c on 10.1.1.1:3642 failed
> distcc[25525] (dcc_build_somewhere) Warning: remote compilation of 'compiler.c' failed, retrying locally
> distcc[25525] Warning: failed to distribute compiler.c to 10.1.1.1:3642, running locally instead
> gcc: error: unrecognized command line option ‘-Qunused-arguments’; did you mean ‘-Wunused-parameter’?
> gcc: error: unrecognized command line option ‘-mavx2’
> distcc[25525] ERROR: compile compiler.c on localhost failed
int32/portable3/compiler.c compiler exited 1
int32/portable3/version.c compiling
output
> gcc: error: unrecognized command line option ‘-Qunused-arguments’; did you mean ‘-Wunused-parameter’?
> gcc: error: unrecognized command line option ‘-mavx2’
> distcc[728] ERROR: compile version.c on 10.1.1.1:3642 failed
> distcc[728] (dcc_build_somewhere) Warning: remote compilation of 'version.c' failed, retrying locally
> distcc[728] Warning: failed to distribute version.c to 10.1.1.1:3642, running locally instead
> gcc: error: unrecognized command line option ‘-Qunused-arguments’; did you mean ‘-Wunused-parameter’?
> gcc: error: unrecognized command line option ‘-mavx2’
> distcc[728] ERROR: compile version.c on localhost failed
int32/portable3/version.c compiler exited 1
int32/portable3/implementation.c compiling
output
> gcc: error: unrecognized command line option ‘-Qunused-arguments’; did you mean ‘-Wunused-parameter’?
> gcc: error: unrecognized command line option ‘-mavx2’
> distcc[13979] ERROR: compile implementation.c on 10.1.1.1:3642 failed
> distcc[13979] (dcc_build_somewhere) Warning: remote compilation of 'implementation.c' failed, retrying locally
> distcc[13979] Warning: failed to distribute implementation.c to 10.1.1.1:3642, running locally instead
> gcc: error: unrecognized command line option ‘-Qunused-arguments’; did you mean ‘-Wunused-parameter’?
> gcc: error: unrecognized command line option ‘-mavx2’
> distcc[13979] ERROR: compile implementation.c on localhost failed
int32/portable3/implementation.c compiler exited 1
int32/portable3/cycles.c compiling
output
> gcc: error: unrecognized command line option ‘-Qunused-arguments’; did you mean ‘-Wunused-parameter’?
> gcc: error: unrecognized command line option ‘-mavx2’
> distcc[25188] ERROR: compile cycles.c on 10.1.1.1:3642 failed
> distcc[25188] (dcc_build_somewhere) Warning: remote compilation of 'cycles.c' failed, retrying locally
> distcc[25188] Warning: failed to distribute cycles.c to 10.1.1.1:3642, running locally instead
> gcc: error: unrecognized command line option ‘-Qunused-arguments’; did you mean ‘-Wunused-parameter’?
> gcc: error: unrecognized command line option ‘-mavx2’
> distcc[25188] ERROR: compile cycles.c on localhost failed
int32/portable3/cycles.c compiler exited 1
int32/portable3/works.c compiling
output
> gcc: error: unrecognized command line option ‘-Qunused-arguments’; did you mean ‘-Wunused-parameter’?
> gcc: error: unrecognized command line option ‘-mavx2’
> distcc[12509] ERROR: compile works.c on 10.1.1.1:3642 failed
> distcc[12509] (dcc_build_somewhere) Warning: remote compilation of 'works.c' failed, retrying locally
> distcc[12509] Warning: failed to distribute works.c to 10.1.1.1:3642, running locally instead
> gcc: error: unrecognized command line option ‘-Qunused-arguments’; did you mean ‘-Wunused-parameter’?
> gcc: error: unrecognized command line option ‘-mavx2’
> distcc[12509] ERROR: compile works.c on localhost failed
int32/portable3/works.c compiler exited 1
int32/portable4 compiling gcc -fPIC -Wall -fomit-frame-pointer -fwrapv -O3
int32/portable4/sort.c compiling
int32/portable4/compiler.c compiling
int32/portable4/version.c compiling
int32/portable4/implementation.c compiling
int32/portable4/cycles.c compiling
int32/portable4/works.c compiling
int32/portable4 compiled gcc -fPIC -Wall -fomit-frame-pointer -fwrapv -O3
int32/portable4 warning: namespace violation: sort.o __sparc_get_pc_thunk.l7 W djbsort_int32_priv___sparc_get_pc_thunk.l7
int32/portable4 compiling gcc -fPIC -Wall -fomit-frame-pointer -fwrapv -march=core-avx2 -O3
int32/portable4/sort.c compiling
output
> gcc: error: unrecognized command line option ‘-march=core-avx2’
> distcc[8247] ERROR: compile sort.c on 10.1.1.1:3642 failed
> distcc[8247] (dcc_build_somewhere) Warning: remote compilation of 'sort.c' failed, retrying locally
> distcc[8247] Warning: failed to distribute sort.c to 10.1.1.1:3642, running locally instead
> gcc: error: unrecognized command line option ‘-march=core-avx2’
> distcc[8247] ERROR: compile sort.c on localhost failed
int32/portable4/sort.c compiler exited 1
int32/portable4/compiler.c compiling
output
> gcc: error: unrecognized command line option ‘-march=core-avx2’
> distcc[7177] ERROR: compile compiler.c on 10.1.1.1:3642 failed
> distcc[7177] (dcc_build_somewhere) Warning: remote compilation of 'compiler.c' failed, retrying locally
> distcc[7177] Warning: failed to distribute compiler.c to 10.1.1.1:3642, running locally instead
> gcc: error: unrecognized command line option ‘-march=core-avx2’
> distcc[7177] ERROR: compile compiler.c on localhost failed
int32/portable4/compiler.c compiler exited 1
int32/portable4/version.c compiling
output
> gcc: error: unrecognized command line option ‘-march=core-avx2’
> distcc[16146] ERROR: compile version.c on 10.1.1.1:3642 failed
> distcc[16146] (dcc_build_somewhere) Warning: remote compilation of 'version.c' failed, retrying locally
> distcc[16146] Warning: failed to distribute version.c to 10.1.1.1:3642, running locally instead
> gcc: error: unrecognized command line option ‘-march=core-avx2’
> distcc[16146] ERROR: compile version.c on localhost failed
int32/portable4/version.c compiler exited 1
int32/portable4/implementation.c compiling
output
> gcc: error: unrecognized command line option ‘-march=core-avx2’
> distcc[5897] ERROR: compile implementation.c on 10.1.1.1:3642 failed
> distcc[5897] (dcc_build_somewhere) Warning: remote compilation of 'implementation.c' failed, retrying locally
> distcc[5897] Warning: failed to distribute implementation.c to 10.1.1.1:3642, running locally instead
> gcc: error: unrecognized command line option ‘-march=core-avx2’
> distcc[5897] ERROR: compile implementation.c on localhost failed
int32/portable4/implementation.c compiler exited 1
int32/portable4/cycles.c compiling
output
> gcc: error: unrecognized command line option ‘-march=core-avx2’
> distcc[17941] ERROR: compile cycles.c on 10.1.1.1:3642 failed
> distcc[17941] (dcc_build_somewhere) Warning: remote compilation of 'cycles.c' failed, retrying locally
> distcc[17941] Warning: failed to distribute cycles.c to 10.1.1.1:3642, running locally instead
> gcc: error: unrecognized command line option ‘-march=core-avx2’
> distcc[17941] ERROR: compile cycles.c on localhost failed
int32/portable4/cycles.c compiler exited 1
int32/portable4/works.c compiling
output
> gcc: error: unrecognized command line option ‘-march=core-avx2’
> distcc[6696] ERROR: compile works.c on 10.1.1.1:3642 failed
> distcc[6696] (dcc_build_somewhere) Warning: remote compilation of 'works.c' failed, retrying locally
> distcc[6696] Warning: failed to distribute works.c to 10.1.1.1:3642, running locally instead
> gcc: error: unrecognized command line option ‘-march=core-avx2’
> distcc[6696] ERROR: compile works.c on localhost failed
int32/portable4/works.c compiler exited 1
int32/portable4 compiling clang -fPIC -Wall -fomit-frame-pointer -fwrapv -Qunused-arguments -O3
int32/portable4/sort.c compiling
output
> gcc: error: unrecognized command line option ‘-Qunused-arguments’; did you mean ‘-Wunused-parameter’?
> distcc[25415] ERROR: compile sort.c on 10.1.1.1:3642 failed
> distcc[25415] (dcc_build_somewhere) Warning: remote compilation of 'sort.c' failed, retrying locally
> distcc[25415] Warning: failed to distribute sort.c to 10.1.1.1:3642, running locally instead
> gcc: error: unrecognized command line option ‘-Qunused-arguments’; did you mean ‘-Wunused-parameter’?
> distcc[25415] ERROR: compile sort.c on localhost failed
int32/portable4/sort.c compiler exited 1
int32/portable4/compiler.c compiling
output
> gcc: error: unrecognized command line option ‘-Qunused-arguments’; did you mean ‘-Wunused-parameter’?
> distcc[18017] ERROR: compile compiler.c on 10.1.1.1:3642 failed
> distcc[18017] (dcc_build_somewhere) Warning: remote compilation of 'compiler.c' failed, retrying locally
> distcc[18017] Warning: failed to distribute compiler.c to 10.1.1.1:3642, running locally instead
> gcc: error: unrecognized command line option ‘-Qunused-arguments’; did you mean ‘-Wunused-parameter’?
> distcc[18017] ERROR: compile compiler.c on localhost failed
int32/portable4/compiler.c compiler exited 1
int32/portable4/version.c compiling
output
> gcc: error: unrecognized command line option ‘-Qunused-arguments’; did you mean ‘-Wunused-parameter’?
> distcc[25641] ERROR: compile version.c on 10.1.1.1:3642 failed
> distcc[25641] (dcc_build_somewhere) Warning: remote compilation of 'version.c' failed, retrying locally
> distcc[25641] Warning: failed to distribute version.c to 10.1.1.1:3642, running locally instead
> gcc: error: unrecognized command line option ‘-Qunused-arguments’; did you mean ‘-Wunused-parameter’?
> distcc[25641] ERROR: compile version.c on localhost failed
int32/portable4/version.c compiler exited 1
int32/portable4/implementation.c compiling
output
> gcc: error: unrecognized command line option ‘-Qunused-arguments’; did you mean ‘-Wunused-parameter’?
> distcc[16499] ERROR: compile implementation.c on 10.1.1.1:3642 failed
> distcc[16499] (dcc_build_somewhere) Warning: remote compilation of 'implementation.c' failed, retrying locally
> distcc[16499] Warning: failed to distribute implementation.c to 10.1.1.1:3642, running locally instead
> gcc: error: unrecognized command line option ‘-Qunused-arguments’; did you mean ‘-Wunused-parameter’?
> distcc[16499] ERROR: compile implementation.c on localhost failed
int32/portable4/implementation.c compiler exited 1
int32/portable4/cycles.c compiling
output
> gcc: error: unrecognized command line option ‘-Qunused-arguments’; did you mean ‘-Wunused-parameter’?
> distcc[25663] ERROR: compile cycles.c on 10.1.1.1:3642 failed
> distcc[25663] (dcc_build_somewhere) Warning: remote compilation of 'cycles.c' failed, retrying locally
> distcc[25663] Warning: failed to distribute cycles.c to 10.1.1.1:3642, running locally instead
> gcc: error: unrecognized command line option ‘-Qunused-arguments’; did you mean ‘-Wunused-parameter’?
> distcc[25663] ERROR: compile cycles.c on localhost failed
int32/portable4/cycles.c compiler exited 1
int32/portable4/works.c compiling
output
> gcc: error: unrecognized command line option ‘-Qunused-arguments’; did you mean ‘-Wunused-parameter’?
> distcc[16037] ERROR: compile works.c on 10.1.1.1:3642 failed
> distcc[16037] (dcc_build_somewhere) Warning: remote compilation of 'works.c' failed, retrying locally
> distcc[16037] Warning: failed to distribute works.c to 10.1.1.1:3642, running locally instead
> gcc: error: unrecognized command line option ‘-Qunused-arguments’; did you mean ‘-Wunused-parameter’?
> distcc[16037] ERROR: compile works.c on localhost failed
int32/portable4/works.c compiler exited 1
int32/portable4 compiling clang -fPIC -Wall -fomit-frame-pointer -fwrapv -Qunused-arguments -mavx2 -O3
int32/portable4/sort.c compiling
output
> gcc: error: unrecognized command line option ‘-Qunused-arguments’; did you mean ‘-Wunused-parameter’?
> gcc: error: unrecognized command line option ‘-mavx2’
> distcc[11088] ERROR: compile sort.c on 10.1.1.1:3642 failed
> distcc[11088] (dcc_build_somewhere) Warning: remote compilation of 'sort.c' failed, retrying locally
> distcc[11088] Warning: failed to distribute sort.c to 10.1.1.1:3642, running locally instead
> gcc: error: unrecognized command line option ‘-Qunused-arguments’; did you mean ‘-Wunused-parameter’?
> gcc: error: unrecognized command line option ‘-mavx2’
> distcc[11088] ERROR: compile sort.c on localhost failed
int32/portable4/sort.c compiler exited 1
int32/portable4/compiler.c compiling
output
> gcc: error: unrecognized command line option ‘-Qunused-arguments’; did you mean ‘-Wunused-parameter’?
> gcc: error: unrecognized command line option ‘-mavx2’
> distcc[3958] ERROR: compile compiler.c on 10.1.1.1:3642 failed
> distcc[3958] (dcc_build_somewhere) Warning: remote compilation of 'compiler.c' failed, retrying locally
> distcc[3958] Warning: failed to distribute compiler.c to 10.1.1.1:3642, running locally instead
> gcc: error: unrecognized command line option ‘-Qunused-arguments’; did you mean ‘-Wunused-parameter’?
> gcc: error: unrecognized command line option ‘-mavx2’
> distcc[3958] ERROR: compile compiler.c on localhost failed
int32/portable4/compiler.c compiler exited 1
int32/portable4/version.c compiling
output
> gcc: error: unrecognized command line option ‘-Qunused-arguments’; did you mean ‘-Wunused-parameter’?
> gcc: error: unrecognized command line option ‘-mavx2’
> distcc[26259] ERROR: compile version.c on 10.1.1.1:3642 failed
> distcc[26259] (dcc_build_somewhere) Warning: remote compilation of 'version.c' failed, retrying locally
> distcc[26259] Warning: failed to distribute version.c to 10.1.1.1:3642, running locally instead
> gcc: error: unrecognized command line option ‘-Qunused-arguments’; did you mean ‘-Wunused-parameter’?
> gcc: error: unrecognized command line option ‘-mavx2’
> distcc[26259] ERROR: compile version.c on localhost failed
int32/portable4/version.c compiler exited 1
int32/portable4/implementation.c compiling
output
> gcc: error: unrecognized command line option ‘-Qunused-arguments’; did you mean ‘-Wunused-parameter’?
> gcc: error: unrecognized command line option ‘-mavx2’
> distcc[11661] ERROR: compile implementation.c on 10.1.1.1:3642 failed
> distcc[11661] (dcc_build_somewhere) Warning: remote compilation of 'implementation.c' failed, retrying locally
> distcc[11661] Warning: failed to distribute implementation.c to 10.1.1.1:3642, running locally instead
> gcc: error: unrecognized command line option ‘-Qunused-arguments’; did you mean ‘-Wunused-parameter’?
> gcc: error: unrecognized command line option ‘-mavx2’
> distcc[11661] ERROR: compile implementation.c on localhost failed
int32/portable4/implementation.c compiler exited 1
int32/portable4/cycles.c compiling
output
> gcc: error: unrecognized command line option ‘-Qunused-arguments’; did you mean ‘-Wunused-parameter’?
> gcc: error: unrecognized command line option ‘-mavx2’
> distcc[25127] ERROR: compile cycles.c on 10.1.1.1:3642 failed
> distcc[25127] (dcc_build_somewhere) Warning: remote compilation of 'cycles.c' failed, retrying locally
> distcc[25127] Warning: failed to distribute cycles.c to 10.1.1.1:3642, running locally instead
> gcc: error: unrecognized command line option ‘-Qunused-arguments’; did you mean ‘-Wunused-parameter’?
> gcc: error: unrecognized command line option ‘-mavx2’
> distcc[25127] ERROR: compile cycles.c on localhost failed
int32/portable4/cycles.c compiler exited 1
int32/portable4/works.c compiling
output
> gcc: error: unrecognized command line option ‘-Qunused-arguments’; did you mean ‘-Wunused-parameter’?
> gcc: error: unrecognized command line option ‘-mavx2’
> distcc[7820] ERROR: compile works.c on 10.1.1.1:3642 failed
> distcc[7820] (dcc_build_somewhere) Warning: remote compilation of 'works.c' failed, retrying locally
> distcc[7820] Warning: failed to distribute works.c to 10.1.1.1:3642, running locally instead
> gcc: error: unrecognized command line option ‘-Qunused-arguments’; did you mean ‘-Wunused-parameter’?
> gcc: error: unrecognized command line option ‘-mavx2’
> distcc[7820] ERROR: compile works.c on localhost failed
int32/portable4/works.c compiler exited 1
uint32/useint32 compiling gcc -fPIC -Wall -fomit-frame-pointer -fwrapv -O3
uint32/useint32/sort.c compiling
uint32/useint32/compiler.c compiling
uint32/useint32/version.c compiling
uint32/useint32/implementation.c compiling
uint32/useint32/cycles.c compiling
uint32/useint32/works.c compiling
uint32/useint32 compiled gcc -fPIC -Wall -fomit-frame-pointer -fwrapv -O3
uint32/useint32 warning: namespace violation: sort.o __sparc_get_pc_thunk.l7 W djbsort_uint32_priv___sparc_get_pc_thunk.l7
uint32/useint32 compiling gcc -fPIC -Wall -fomit-frame-pointer -fwrapv -march=core-avx2 -O3
uint32/useint32/sort.c compiling
output
> gcc: error: unrecognized command line option ‘-march=core-avx2’
> distcc[6900] ERROR: compile sort.c on 10.1.1.1:3642 failed
> distcc[6900] (dcc_build_somewhere) Warning: remote compilation of 'sort.c' failed, retrying locally
> distcc[6900] Warning: failed to distribute sort.c to 10.1.1.1:3642, running locally instead
> gcc: error: unrecognized command line option ‘-march=core-avx2’
> distcc[6900] ERROR: compile sort.c on localhost failed
uint32/useint32/sort.c compiler exited 1
uint32/useint32/compiler.c compiling
output
> gcc: error: unrecognized command line option ‘-march=core-avx2’
> distcc[22340] ERROR: compile compiler.c on 10.1.1.1:3642 failed
> distcc[22340] (dcc_build_somewhere) Warning: remote compilation of 'compiler.c' failed, retrying locally
> distcc[22340] Warning: failed to distribute compiler.c to 10.1.1.1:3642, running locally instead
> gcc: error: unrecognized command line option ‘-march=core-avx2’
> distcc[22340] ERROR: compile compiler.c on localhost failed
uint32/useint32/compiler.c compiler exited 1
uint32/useint32/version.c compiling
output
> gcc: error: unrecognized command line option ‘-march=core-avx2’
> distcc[1720] ERROR: compile version.c on 10.1.1.1:3642 failed
> distcc[1720] (dcc_build_somewhere) Warning: remote compilation of 'version.c' failed, retrying locally
> distcc[1720] Warning: failed to distribute version.c to 10.1.1.1:3642, running locally instead
> gcc: error: unrecognized command line option ‘-march=core-avx2’
> distcc[1720] ERROR: compile version.c on localhost failed
uint32/useint32/version.c compiler exited 1
uint32/useint32/implementation.c compiling
output
> gcc: error: unrecognized command line option ‘-march=core-avx2’
> distcc[15796] ERROR: compile implementation.c on 10.1.1.1:3642 failed
> distcc[15796] (dcc_build_somewhere) Warning: remote compilation of 'implementation.c' failed, retrying locally
> distcc[15796] Warning: failed to distribute implementation.c to 10.1.1.1:3642, running locally instead
> gcc: error: unrecognized command line option ‘-march=core-avx2’
> distcc[15796] ERROR: compile implementation.c on localhost failed
uint32/useint32/implementation.c compiler exited 1
uint32/useint32/cycles.c compiling
output
> gcc: error: unrecognized command line option ‘-march=core-avx2’
> distcc[22406] ERROR: compile cycles.c on 10.1.1.1:3642 failed
> distcc[22406] (dcc_build_somewhere) Warning: remote compilation of 'cycles.c' failed, retrying locally
> distcc[22406] Warning: failed to distribute cycles.c to 10.1.1.1:3642, running locally instead
> gcc: error: unrecognized command line option ‘-march=core-avx2’
> distcc[22406] ERROR: compile cycles.c on localhost failed
uint32/useint32/cycles.c compiler exited 1
uint32/useint32/works.c compiling
output
> gcc: error: unrecognized command line option ‘-march=core-avx2’
> distcc[10147] ERROR: compile works.c on 10.1.1.1:3642 failed
> distcc[10147] (dcc_build_somewhere) Warning: remote compilation of 'works.c' failed, retrying locally
> distcc[10147] Warning: failed to distribute works.c to 10.1.1.1:3642, running locally instead
> gcc: error: unrecognized command line option ‘-march=core-avx2’
> distcc[10147] ERROR: compile works.c on localhost failed
uint32/useint32/works.c compiler exited 1
uint32/useint32 compiling clang -fPIC -Wall -fomit-frame-pointer -fwrapv -Qunused-arguments -O3
uint32/useint32/sort.c compiling
output
> gcc: error: unrecognized command line option ‘-Qunused-arguments’; did you mean ‘-Wunused-parameter’?
> distcc[4019] ERROR: compile sort.c on 10.1.1.1:3642 failed
> distcc[4019] (dcc_build_somewhere) Warning: remote compilation of 'sort.c' failed, retrying locally
> distcc[4019] Warning: failed to distribute sort.c to 10.1.1.1:3642, running locally instead
> gcc: error: unrecognized command line option ‘-Qunused-arguments’; did you mean ‘-Wunused-parameter’?
> distcc[4019] ERROR: compile sort.c on localhost failed
uint32/useint32/sort.c compiler exited 1
uint32/useint32/compiler.c compiling
output
> gcc: error: unrecognized command line option ‘-Qunused-arguments’; did you mean ‘-Wunused-parameter’?
> distcc[11706] ERROR: compile compiler.c on 10.1.1.1:3642 failed
> distcc[11706] (dcc_build_somewhere) Warning: remote compilation of 'compiler.c' failed, retrying locally
> distcc[11706] Warning: failed to distribute compiler.c to 10.1.1.1:3642, running locally instead
> gcc: error: unrecognized command line option ‘-Qunused-arguments’; did you mean ‘-Wunused-parameter’?
> distcc[11706] ERROR: compile compiler.c on localhost failed
uint32/useint32/compiler.c compiler exited 1
uint32/useint32/version.c compiling
output
> gcc: error: unrecognized command line option ‘-Qunused-arguments’; did you mean ‘-Wunused-parameter’?
> distcc[22642] ERROR: compile version.c on 10.1.1.1:3642 failed
> distcc[22642] (dcc_build_somewhere) Warning: remote compilation of 'version.c' failed, retrying locally
> distcc[22642] Warning: failed to distribute version.c to 10.1.1.1:3642, running locally instead
> gcc: error: unrecognized command line option ‘-Qunused-arguments’; did you mean ‘-Wunused-parameter’?
> distcc[22642] ERROR: compile version.c on localhost failed
uint32/useint32/version.c compiler exited 1
uint32/useint32/implementation.c compiling
output
> gcc: error: unrecognized command line option ‘-Qunused-arguments’; did you mean ‘-Wunused-parameter’?
> distcc[10374] ERROR: compile implementation.c on 10.1.1.1:3642 failed
> distcc[10374] (dcc_build_somewhere) Warning: remote compilation of 'implementation.c' failed, retrying locally
> distcc[10374] Warning: failed to distribute implementation.c to 10.1.1.1:3642, running locally instead
> gcc: error: unrecognized command line option ‘-Qunused-arguments’; did you mean ‘-Wunused-parameter’?
> distcc[10374] ERROR: compile implementation.c on localhost failed
uint32/useint32/implementation.c compiler exited 1
uint32/useint32/cycles.c compiling
output
> gcc: error: unrecognized command line option ‘-Qunused-arguments’; did you mean ‘-Wunused-parameter’?
> distcc[26522] ERROR: compile cycles.c on 10.1.1.1:3642 failed
> distcc[26522] (dcc_build_somewhere) Warning: remote compilation of 'cycles.c' failed, retrying locally
> distcc[26522] Warning: failed to distribute cycles.c to 10.1.1.1:3642, running locally instead
> gcc: error: unrecognized command line option ‘-Qunused-arguments’; did you mean ‘-Wunused-parameter’?
> distcc[26522] ERROR: compile cycles.c on localhost failed
uint32/useint32/cycles.c compiler exited 1
uint32/useint32/works.c compiling
output
> gcc: error: unrecognized command line option ‘-Qunused-arguments’; did you mean ‘-Wunused-parameter’?
> distcc[19525] ERROR: compile works.c on 10.1.1.1:3642 failed
> distcc[19525] (dcc_build_somewhere) Warning: remote compilation of 'works.c' failed, retrying locally
> distcc[19525] Warning: failed to distribute works.c to 10.1.1.1:3642, running locally instead
> gcc: error: unrecognized command line option ‘-Qunused-arguments’; did you mean ‘-Wunused-parameter’?
> distcc[19525] ERROR: compile works.c on localhost failed
uint32/useint32/works.c compiler exited 1
uint32/useint32 compiling clang -fPIC -Wall -fomit-frame-pointer -fwrapv -Qunused-arguments -mavx2 -O3
uint32/useint32/sort.c compiling
output
> gcc: error: unrecognized command line option ‘-Qunused-arguments’; did you mean ‘-Wunused-parameter’?
> gcc: error: unrecognized command line option ‘-mavx2’
> distcc[461] ERROR: compile sort.c on 10.1.1.1:3642 failed
> distcc[461] (dcc_build_somewhere) Warning: remote compilation of 'sort.c' failed, retrying locally
> distcc[461] Warning: failed to distribute sort.c to 10.1.1.1:3642, running locally instead
> gcc: error: unrecognized command line option ‘-Qunused-arguments’; did you mean ‘-Wunused-parameter’?
> gcc: error: unrecognized command line option ‘-mavx2’
> distcc[461] ERROR: compile sort.c on localhost failed
uint32/useint32/sort.c compiler exited 1
uint32/useint32/compiler.c compiling
output
> gcc: error: unrecognized command line option ‘-Qunused-arguments’; did you mean ‘-Wunused-parameter’?
> gcc: error: unrecognized command line option ‘-mavx2’
> distcc[4864] ERROR: compile compiler.c on 10.1.1.1:3642 failed
> distcc[4864] (dcc_build_somewhere) Warning: remote compilation of 'compiler.c' failed, retrying locally
> distcc[4864] Warning: failed to distribute compiler.c to 10.1.1.1:3642, running locally instead
> gcc: error: unrecognized command line option ‘-Qunused-arguments’; did you mean ‘-Wunused-parameter’?
> gcc: error: unrecognized command line option ‘-mavx2’
> distcc[4864] ERROR: compile compiler.c on localhost failed
uint32/useint32/compiler.c compiler exited 1
uint32/useint32/version.c compiling
output
> gcc: error: unrecognized command line option ‘-Qunused-arguments’; did you mean ‘-Wunused-parameter’?
> gcc: error: unrecognized command line option ‘-mavx2’
> distcc[20473] ERROR: compile version.c on 10.1.1.1:3642 failed
> distcc[20473] (dcc_build_somewhere) Warning: remote compilation of 'version.c' failed, retrying locally
> distcc[20473] Warning: failed to distribute version.c to 10.1.1.1:3642, running locally instead
> gcc: error: unrecognized command line option ‘-Qunused-arguments’; did you mean ‘-Wunused-parameter’?
> gcc: error: unrecognized command line option ‘-mavx2’
> distcc[20473] ERROR: compile version.c on localhost failed
uint32/useint32/version.c compiler exited 1
uint32/useint32/implementation.c compiling
output
> gcc: error: unrecognized command line option ‘-Qunused-arguments’; did you mean ‘-Wunused-parameter’?
> gcc: error: unrecognized command line option ‘-mavx2’
> distcc[15762] ERROR: compile implementation.c on 10.1.1.1:3642 failed
> distcc[15762] (dcc_build_somewhere) Warning: remote compilation of 'implementation.c' failed, retrying locally
> distcc[15762] Warning: failed to distribute implementation.c to 10.1.1.1:3642, running locally instead
> gcc: error: unrecognized command line option ‘-Qunused-arguments’; did you mean ‘-Wunused-parameter’?
> gcc: error: unrecognized command line option ‘-mavx2’
> distcc[15762] ERROR: compile implementation.c on localhost failed
uint32/useint32/implementation.c compiler exited 1
uint32/useint32/cycles.c compiling
output
> gcc: error: unrecognized command line option ‘-Qunused-arguments’; did you mean ‘-Wunused-parameter’?
> gcc: error: unrecognized command line option ‘-mavx2’
> distcc[28431] ERROR: compile cycles.c on 10.1.1.1:3642 failed
> distcc[28431] (dcc_build_somewhere) Warning: remote compilation of 'cycles.c' failed, retrying locally
> distcc[28431] Warning: failed to distribute cycles.c to 10.1.1.1:3642, running locally instead
> gcc: error: unrecognized command line option ‘-Qunused-arguments’; did you mean ‘-Wunused-parameter’?
> gcc: error: unrecognized command line option ‘-mavx2’
> distcc[28431] ERROR: compile cycles.c on localhost failed
uint32/useint32/cycles.c compiler exited 1
uint32/useint32/works.c compiling
output
> gcc: error: unrecognized command line option ‘-Qunused-arguments’; did you mean ‘-Wunused-parameter’?
> gcc: error: unrecognized command line option ‘-mavx2’
> distcc[14092] ERROR: compile works.c on 10.1.1.1:3642 failed
> distcc[14092] (dcc_build_somewhere) Warning: remote compilation of 'works.c' failed, retrying locally
> distcc[14092] Warning: failed to distribute works.c to 10.1.1.1:3642, running locally instead
> gcc: error: unrecognized command line option ‘-Qunused-arguments’; did you mean ‘-Wunused-parameter’?
> gcc: error: unrecognized command line option ‘-mavx2’
> distcc[14092] ERROR: compile works.c on localhost failed
uint32/useint32/works.c compiler exited 1
float32/useint32 compiling gcc -fPIC -Wall -fomit-frame-pointer -fwrapv -O3
float32/useint32/sort.c compiling
float32/useint32/compiler.c compiling
float32/useint32/version.c compiling
float32/useint32/implementation.c compiling
float32/useint32/cycles.c compiling
float32/useint32/works.c compiling
float32/useint32 compiled gcc -fPIC -Wall -fomit-frame-pointer -fwrapv -O3
float32/useint32 warning: namespace violation: sort.o __sparc_get_pc_thunk.l7 W djbsort_float32_priv___sparc_get_pc_thunk.l7
float32/useint32 compiling gcc -fPIC -Wall -fomit-frame-pointer -fwrapv -march=core-avx2 -O3
float32/useint32/sort.c compiling
output
> gcc: error: unrecognized command line option ‘-march=core-avx2’
> distcc[16875] ERROR: compile sort.c on 10.1.1.1:3642 failed
> distcc[16875] (dcc_build_somewhere) Warning: remote compilation of 'sort.c' failed, retrying locally
> distcc[16875] Warning: failed to distribute sort.c to 10.1.1.1:3642, running locally instead
> gcc: error: unrecognized command line option ‘-march=core-avx2’
> distcc[16875] ERROR: compile sort.c on localhost failed
float32/useint32/sort.c compiler exited 1
float32/useint32/compiler.c compiling
output
> gcc: error: unrecognized command line option ‘-march=core-avx2’
> distcc[16086] ERROR: compile compiler.c on 10.1.1.1:3642 failed
> distcc[16086] (dcc_build_somewhere) Warning: remote compilation of 'compiler.c' failed, retrying locally
> distcc[16086] Warning: failed to distribute compiler.c to 10.1.1.1:3642, running locally instead
> gcc: error: unrecognized command line option ‘-march=core-avx2’
> distcc[16086] ERROR: compile compiler.c on localhost failed
float32/useint32/compiler.c compiler exited 1
float32/useint32/version.c compiling
output
> gcc: error: unrecognized command line option ‘-march=core-avx2’
> distcc[9605] ERROR: compile version.c on 10.1.1.1:3642 failed
> distcc[9605] (dcc_build_somewhere) Warning: remote compilation of 'version.c' failed, retrying locally
> distcc[9605] Warning: failed to distribute version.c to 10.1.1.1:3642, running locally instead
> gcc: error: unrecognized command line option ‘-march=core-avx2’
> distcc[9605] ERROR: compile version.c on localhost failed
float32/useint32/version.c compiler exited 1
float32/useint32/implementation.c compiling
output
> gcc: error: unrecognized command line option ‘-march=core-avx2’
> distcc[11970] ERROR: compile implementation.c on 10.1.1.1:3642 failed
> distcc[11970] (dcc_build_somewhere) Warning: remote compilation of 'implementation.c' failed, retrying locally
> distcc[11970] Warning: failed to distribute implementation.c to 10.1.1.1:3642, running locally instead
> gcc: error: unrecognized command line option ‘-march=core-avx2’
> distcc[11970] ERROR: compile implementation.c on localhost failed
float32/useint32/implementation.c compiler exited 1
float32/useint32/cycles.c compiling
output
> gcc: error: unrecognized command line option ‘-march=core-avx2’
> distcc[26020] ERROR: compile cycles.c on 10.1.1.1:3642 failed
> distcc[26020] (dcc_build_somewhere) Warning: remote compilation of 'cycles.c' failed, retrying locally
> distcc[26020] Warning: failed to distribute cycles.c to 10.1.1.1:3642, running locally instead
> gcc: error: unrecognized command line option ‘-march=core-avx2’
> distcc[26020] ERROR: compile cycles.c on localhost failed
float32/useint32/cycles.c compiler exited 1
float32/useint32/works.c compiling
output
> gcc: error: unrecognized command line option ‘-march=core-avx2’
> distcc[22737] ERROR: compile works.c on 10.1.1.1:3642 failed
> distcc[22737] (dcc_build_somewhere) Warning: remote compilation of 'works.c' failed, retrying locally
> distcc[22737] Warning: failed to distribute works.c to 10.1.1.1:3642, running locally instead
> gcc: error: unrecognized command line option ‘-march=core-avx2’
> distcc[22737] ERROR: compile works.c on localhost failed
float32/useint32/works.c compiler exited 1
float32/useint32 compiling clang -fPIC -Wall -fomit-frame-pointer -fwrapv -Qunused-arguments -O3
float32/useint32/sort.c compiling
output
> gcc: error: unrecognized command line option ‘-Qunused-arguments’; did you mean ‘-Wunused-parameter’?
> distcc[16680] ERROR: compile sort.c on 10.1.1.1:3642 failed
> distcc[16680] (dcc_build_somewhere) Warning: remote compilation of 'sort.c' failed, retrying locally
> distcc[16680] Warning: failed to distribute sort.c to 10.1.1.1:3642, running locally instead
> gcc: error: unrecognized command line option ‘-Qunused-arguments’; did you mean ‘-Wunused-parameter’?
> distcc[16680] ERROR: compile sort.c on localhost failed
float32/useint32/sort.c compiler exited 1
float32/useint32/compiler.c compiling
output
> gcc: error: unrecognized command line option ‘-Qunused-arguments’; did you mean ‘-Wunused-parameter’?
> distcc[11631] ERROR: compile compiler.c on 10.1.1.1:3642 failed
> distcc[11631] (dcc_build_somewhere) Warning: remote compilation of 'compiler.c' failed, retrying locally
> distcc[11631] Warning: failed to distribute compiler.c to 10.1.1.1:3642, running locally instead
> gcc: error: unrecognized command line option ‘-Qunused-arguments’; did you mean ‘-Wunused-parameter’?
> distcc[11631] ERROR: compile compiler.c on localhost failed
float32/useint32/compiler.c compiler exited 1
float32/useint32/version.c compiling
output
> gcc: error: unrecognized command line option ‘-Qunused-arguments’; did you mean ‘-Wunused-parameter’?
> distcc[5122] ERROR: compile version.c on 10.1.1.1:3642 failed
> distcc[5122] (dcc_build_somewhere) Warning: remote compilation of 'version.c' failed, retrying locally
> distcc[5122] Warning: failed to distribute version.c to 10.1.1.1:3642, running locally instead
> gcc: error: unrecognized command line option ‘-Qunused-arguments’; did you mean ‘-Wunused-parameter’?
> distcc[5122] ERROR: compile version.c on localhost failed
float32/useint32/version.c compiler exited 1
float32/useint32/implementation.c compiling
output
> gcc: error: unrecognized command line option ‘-Qunused-arguments’; did you mean ‘-Wunused-parameter’?
> distcc[19759] ERROR: compile implementation.c on 10.1.1.1:3642 failed
> distcc[19759] (dcc_build_somewhere) Warning: remote compilation of 'implementation.c' failed, retrying locally
> distcc[19759] Warning: failed to distribute implementation.c to 10.1.1.1:3642, running locally instead
> gcc: error: unrecognized command line option ‘-Qunused-arguments’; did you mean ‘-Wunused-parameter’?
> distcc[19759] ERROR: compile implementation.c on localhost failed
float32/useint32/implementation.c compiler exited 1
float32/useint32/cycles.c compiling
output
> gcc: error: unrecognized command line option ‘-Qunused-arguments’; did you mean ‘-Wunused-parameter’?
> distcc[4453] ERROR: compile cycles.c on 10.1.1.1:3642 failed
> distcc[4453] (dcc_build_somewhere) Warning: remote compilation of 'cycles.c' failed, retrying locally
> distcc[4453] Warning: failed to distribute cycles.c to 10.1.1.1:3642, running locally instead
> gcc: error: unrecognized command line option ‘-Qunused-arguments’; did you mean ‘-Wunused-parameter’?
> distcc[4453] ERROR: compile cycles.c on localhost failed
float32/useint32/cycles.c compiler exited 1
float32/useint32/works.c compiling
output
> gcc: error: unrecognized command line option ‘-Qunused-arguments’; did you mean ‘-Wunused-parameter’?
> distcc[152] ERROR: compile works.c on 10.1.1.1:3642 failed
> distcc[152] (dcc_build_somewhere) Warning: remote compilation of 'works.c' failed, retrying locally
> distcc[152] Warning: failed to distribute works.c to 10.1.1.1:3642, running locally instead
> gcc: error: unrecognized command line option ‘-Qunused-arguments’; did you mean ‘-Wunused-parameter’?
> distcc[152] ERROR: compile works.c on localhost failed
float32/useint32/works.c compiler exited 1
float32/useint32 compiling clang -fPIC -Wall -fomit-frame-pointer -fwrapv -Qunused-arguments -mavx2 -O3
float32/useint32/sort.c compiling
output
> gcc: error: unrecognized command line option ‘-Qunused-arguments’; did you mean ‘-Wunused-parameter’?
> gcc: error: unrecognized command line option ‘-mavx2’
> distcc[18011] ERROR: compile sort.c on 10.1.1.1:3642 failed
> distcc[18011] (dcc_build_somewhere) Warning: remote compilation of 'sort.c' failed, retrying locally
> distcc[18011] Warning: failed to distribute sort.c to 10.1.1.1:3642, running locally instead
> gcc: error: unrecognized command line option ‘-Qunused-arguments’; did you mean ‘-Wunused-parameter’?
> gcc: error: unrecognized command line option ‘-mavx2’
> distcc[18011] ERROR: compile sort.c on localhost failed
float32/useint32/sort.c compiler exited 1
float32/useint32/compiler.c compiling
output
> gcc: error: unrecognized command line option ‘-Qunused-arguments’; did you mean ‘-Wunused-parameter’?
> gcc: error: unrecognized command line option ‘-mavx2’
> distcc[9066] ERROR: compile compiler.c on 10.1.1.1:3642 failed
> distcc[9066] (dcc_build_somewhere) Warning: remote compilation of 'compiler.c' failed, retrying locally
> distcc[9066] Warning: failed to distribute compiler.c to 10.1.1.1:3642, running locally instead
> gcc: error: unrecognized command line option ‘-Qunused-arguments’; did you mean ‘-Wunused-parameter’?
> gcc: error: unrecognized command line option ‘-mavx2’
> distcc[9066] ERROR: compile compiler.c on localhost failed
float32/useint32/compiler.c compiler exited 1
float32/useint32/version.c compiling
output
> gcc: error: unrecognized command line option ‘-Qunused-arguments’; did you mean ‘-Wunused-parameter’?
> gcc: error: unrecognized command line option ‘-mavx2’
> distcc[12855] ERROR: compile version.c on 10.1.1.1:3642 failed
> distcc[12855] (dcc_build_somewhere) Warning: remote compilation of 'version.c' failed, retrying locally
> distcc[12855] Warning: failed to distribute version.c to 10.1.1.1:3642, running locally instead
> gcc: error: unrecognized command line option ‘-Qunused-arguments’; did you mean ‘-Wunused-parameter’?
> gcc: error: unrecognized command line option ‘-mavx2’
> distcc[12855] ERROR: compile version.c on localhost failed
float32/useint32/version.c compiler exited 1
float32/useint32/implementation.c compiling
output
> gcc: error: unrecognized command line option ‘-Qunused-arguments’; did you mean ‘-Wunused-parameter’?
> gcc: error: unrecognized command line option ‘-mavx2’
> distcc[14846] ERROR: compile implementation.c on 10.1.1.1:3642 failed
> distcc[14846] (dcc_build_somewhere) Warning: remote compilation of 'implementation.c' failed, retrying locally
> distcc[14846] Warning: failed to distribute implementation.c to 10.1.1.1:3642, running locally instead
> gcc: error: unrecognized command line option ‘-Qunused-arguments’; did you mean ‘-Wunused-parameter’?
> gcc: error: unrecognized command line option ‘-mavx2’
> distcc[14846] ERROR: compile implementation.c on localhost failed
float32/useint32/implementation.c compiler exited 1
float32/useint32/cycles.c compiling
output
> gcc: error: unrecognized command line option ‘-Qunused-arguments’; did you mean ‘-Wunused-parameter’?
> gcc: error: unrecognized command line option ‘-mavx2’
> distcc[7427] ERROR: compile cycles.c on 10.1.1.1:3642 failed
> distcc[7427] (dcc_build_somewhere) Warning: remote compilation of 'cycles.c' failed, retrying locally
> distcc[7427] Warning: failed to distribute cycles.c to 10.1.1.1:3642, running locally instead
> gcc: error: unrecognized command line option ‘-Qunused-arguments’; did you mean ‘-Wunused-parameter’?
> gcc: error: unrecognized command line option ‘-mavx2’
> distcc[7427] ERROR: compile cycles.c on localhost failed
float32/useint32/cycles.c compiler exited 1
float32/useint32/works.c compiling
output
> gcc: error: unrecognized command line option ‘-Qunused-arguments’; did you mean ‘-Wunused-parameter’?
> gcc: error: unrecognized command line option ‘-mavx2’
> distcc[7006] ERROR: compile works.c on 10.1.1.1:3642 failed
> distcc[7006] (dcc_build_somewhere) Warning: remote compilation of 'works.c' failed, retrying locally
> distcc[7006] Warning: failed to distribute works.c to 10.1.1.1:3642, running locally instead
> gcc: error: unrecognized command line option ‘-Qunused-arguments’; did you mean ‘-Wunused-parameter’?
> gcc: error: unrecognized command line option ‘-mavx2’
> distcc[7006] ERROR: compile works.c on localhost failed
float32/useint32/works.c compiler exited 1
command/limits.c compiling gcc -fPIC -Wall -fomit-frame-pointer -fwrapv -O3
command/limits.c compiling gcc -fPIC -Wall -fomit-frame-pointer -fwrapv -march=core-avx2 -O3
output
> gcc: error: unrecognized command line option ‘-march=core-avx2’
> distcc[17196] ERROR: compile limits.c on 10.1.1.1:3642 failed
> distcc[17196] (dcc_build_somewhere) Warning: remote compilation of 'limits.c' failed, retrying locally
> distcc[17196] Warning: failed to distribute limits.c to 10.1.1.1:3642, running locally instead
> gcc: error: unrecognized command line option ‘-march=core-avx2’
> distcc[17196] ERROR: compile limits.c on localhost failed
command/limits.c compiler exited 1
command/limits.c compiling clang -fPIC -Wall -fomit-frame-pointer -fwrapv -Qunused-arguments -O3
output
> gcc: error: unrecognized command line option ‘-Qunused-arguments’; did you mean ‘-Wunused-parameter’?
> distcc[1520] ERROR: compile limits.c on 10.1.1.1:3642 failed
> distcc[1520] (dcc_build_somewhere) Warning: remote compilation of 'limits.c' failed, retrying locally
> distcc[1520] Warning: failed to distribute limits.c to 10.1.1.1:3642, running locally instead
> gcc: error: unrecognized command line option ‘-Qunused-arguments’; did you mean ‘-Wunused-parameter’?
> distcc[1520] ERROR: compile limits.c on localhost failed
command/limits.c compiler exited 1
command/limits.c compiling clang -fPIC -Wall -fomit-frame-pointer -fwrapv -Qunused-arguments -mavx2 -O3
output
> gcc: error: unrecognized command line option ‘-Qunused-arguments’; did you mean ‘-Wunused-parameter’?
> gcc: error: unrecognized command line option ‘-mavx2’
> distcc[18913] ERROR: compile limits.c on 10.1.1.1:3642 failed
> distcc[18913] (dcc_build_somewhere) Warning: remote compilation of 'limits.c' failed, retrying locally
> distcc[18913] Warning: failed to distribute limits.c to 10.1.1.1:3642, running locally instead
> gcc: error: unrecognized command line option ‘-Qunused-arguments’; did you mean ‘-Wunused-parameter’?
> gcc: error: unrecognized command line option ‘-mavx2’
> distcc[18913] ERROR: compile limits.c on localhost failed
command/limits.c compiler exited 1
command/int32-speed.c compiling gcc -fPIC -Wall -fomit-frame-pointer -fwrapv -O3
command/int32-speed.c compiling gcc -fPIC -Wall -fomit-frame-pointer -fwrapv -march=core-avx2 -O3
output
> gcc: error: unrecognized command line option ‘-march=core-avx2’
> distcc[1319] ERROR: compile int32-speed.c on 10.1.1.1:3642 failed
> distcc[1319] (dcc_build_somewhere) Warning: remote compilation of 'int32-speed.c' failed, retrying locally
> distcc[1319] Warning: failed to distribute int32-speed.c to 10.1.1.1:3642, running locally instead
> gcc: error: unrecognized command line option ‘-march=core-avx2’
> distcc[1319] ERROR: compile int32-speed.c on localhost failed
command/int32-speed.c compiler exited 1
command/int32-speed.c compiling clang -fPIC -Wall -fomit-frame-pointer -fwrapv -Qunused-arguments -O3
output
> gcc: error: unrecognized command line option ‘-Qunused-arguments’; did you mean ‘-Wunused-parameter’?
> distcc[17452] ERROR: compile int32-speed.c on 10.1.1.1:3642 failed
> distcc[17452] (dcc_build_somewhere) Warning: remote compilation of 'int32-speed.c' failed, retrying locally
> distcc[17452] Warning: failed to distribute int32-speed.c to 10.1.1.1:3642, running locally instead
> gcc: error: unrecognized command line option ‘-Qunused-arguments’; did you mean ‘-Wunused-parameter’?
> distcc[17452] ERROR: compile int32-speed.c on localhost failed
command/int32-speed.c compiler exited 1
command/int32-speed.c compiling clang -fPIC -Wall -fomit-frame-pointer -fwrapv -Qunused-arguments -mavx2 -O3
output
> gcc: error: unrecognized command line option ‘-Qunused-arguments’; did you mean ‘-Wunused-parameter’?
> gcc: error: unrecognized command line option ‘-mavx2’
> distcc[20253] ERROR: compile int32-speed.c on 10.1.1.1:3642 failed
> distcc[20253] (dcc_build_somewhere) Warning: remote compilation of 'int32-speed.c' failed, retrying locally
> distcc[20253] Warning: failed to distribute int32-speed.c to 10.1.1.1:3642, running locally instead
> gcc: error: unrecognized command line option ‘-Qunused-arguments’; did you mean ‘-Wunused-parameter’?
> gcc: error: unrecognized command line option ‘-mavx2’
> distcc[20253] ERROR: compile int32-speed.c on localhost failed
command/int32-speed.c compiler exited 1
command/uint32-speed.c compiling gcc -fPIC -Wall -fomit-frame-pointer -fwrapv -O3
command/uint32-speed.c compiling gcc -fPIC -Wall -fomit-frame-pointer -fwrapv -march=core-avx2 -O3
output
> gcc: error: unrecognized command line option ‘-march=core-avx2’
> distcc[256] ERROR: compile uint32-speed.c on 10.1.1.1:3642 failed
> distcc[256] (dcc_build_somewhere) Warning: remote compilation of 'uint32-speed.c' failed, retrying locally
> distcc[256] Warning: failed to distribute uint32-speed.c to 10.1.1.1:3642, running locally instead
> gcc: error: unrecognized command line option ‘-march=core-avx2’
> distcc[256] ERROR: compile uint32-speed.c on localhost failed
command/uint32-speed.c compiler exited 1
command/uint32-speed.c compiling clang -fPIC -Wall -fomit-frame-pointer -fwrapv -Qunused-arguments -O3
output
> gcc: error: unrecognized command line option ‘-Qunused-arguments’; did you mean ‘-Wunused-parameter’?
> distcc[18099] ERROR: compile uint32-speed.c on 10.1.1.1:3642 failed
> distcc[18099] (dcc_build_somewhere) Warning: remote compilation of 'uint32-speed.c' failed, retrying locally
> distcc[18099] Warning: failed to distribute uint32-speed.c to 10.1.1.1:3642, running locally instead
> gcc: error: unrecognized command line option ‘-Qunused-arguments’; did you mean ‘-Wunused-parameter’?
> distcc[18099] ERROR: compile uint32-speed.c on localhost failed
command/uint32-speed.c compiler exited 1
command/uint32-speed.c compiling clang -fPIC -Wall -fomit-frame-pointer -fwrapv -Qunused-arguments -mavx2 -O3
output
> gcc: error: unrecognized command line option ‘-Qunused-arguments’; did you mean ‘-Wunused-parameter’?
> gcc: error: unrecognized command line option ‘-mavx2’
> distcc[2203] ERROR: compile uint32-speed.c on 10.1.1.1:3642 failed
> distcc[2203] (dcc_build_somewhere) Warning: remote compilation of 'uint32-speed.c' failed, retrying locally
> distcc[2203] Warning: failed to distribute uint32-speed.c to 10.1.1.1:3642, running locally instead
> gcc: error: unrecognized command line option ‘-Qunused-arguments’; did you mean ‘-Wunused-parameter’?
> gcc: error: unrecognized command line option ‘-mavx2’
> distcc[2203] ERROR: compile uint32-speed.c on localhost failed
command/uint32-speed.c compiler exited 1
command/float32-speed.c compiling gcc -fPIC -Wall -fomit-frame-pointer -fwrapv -O3
command/float32-speed.c compiling gcc -fPIC -Wall -fomit-frame-pointer -fwrapv -march=core-avx2 -O3
output
> gcc: error: unrecognized command line option ‘-march=core-avx2’
> distcc[24749] ERROR: compile float32-speed.c on 10.1.1.1:3642 failed
> distcc[24749] (dcc_build_somewhere) Warning: remote compilation of 'float32-speed.c' failed, retrying locally
> distcc[24749] Warning: failed to distribute float32-speed.c to 10.1.1.1:3642, running locally instead
> gcc: error: unrecognized command line option ‘-march=core-avx2’
> distcc[24749] ERROR: compile float32-speed.c on localhost failed
command/float32-speed.c compiler exited 1
command/float32-speed.c compiling clang -fPIC -Wall -fomit-frame-pointer -fwrapv -Qunused-arguments -O3
output
> gcc: error: unrecognized command line option ‘-Qunused-arguments’; did you mean ‘-Wunused-parameter’?
> distcc[14926] ERROR: compile float32-speed.c on 10.1.1.1:3642 failed
> distcc[14926] (dcc_build_somewhere) Warning: remote compilation of 'float32-speed.c' failed, retrying locally
> distcc[14926] Warning: failed to distribute float32-speed.c to 10.1.1.1:3642, running locally instead
> gcc: error: unrecognized command line option ‘-Qunused-arguments’; did you mean ‘-Wunused-parameter’?
> distcc[14926] ERROR: compile float32-speed.c on localhost failed
command/float32-speed.c compiler exited 1
command/float32-speed.c compiling clang -fPIC -Wall -fomit-frame-pointer -fwrapv -Qunused-arguments -mavx2 -O3
output
> gcc: error: unrecognized command line option ‘-Qunused-arguments’; did you mean ‘-Wunused-parameter’?
> gcc: error: unrecognized command line option ‘-mavx2’
> distcc[28859] ERROR: compile float32-speed.c on 10.1.1.1:3642 failed
> distcc[28859] (dcc_build_somewhere) Warning: remote compilation of 'float32-speed.c' failed, retrying locally
> distcc[28859] Warning: failed to distribute float32-speed.c to 10.1.1.1:3642, running locally instead
> gcc: error: unrecognized command line option ‘-Qunused-arguments’; did you mean ‘-Wunused-parameter’?
> gcc: error: unrecognized command line option ‘-mavx2’
> distcc[28859] ERROR: compile float32-speed.c on localhost failed
command/float32-speed.c compiler exited 1
build finishing successfully
/bin/cp pseudo-PLIST /tmp/pkgbuild/math/djbsort/work.sparc64/djbsort-20190516
cd /tmp/pkgbuild/math/djbsort/work.sparc64/djbsort-20190516 && /usr/bin/find . -type f | /usr/bin/sort | /usr/bin/sed -e 's|^\.|share/djbsort|g' > /tmp/pkgbuild/math/djbsort/work.sparc64/PLIST_DYNAMIC