=> Bootstrap dependency digest>=20211023: found digest-20220214
===> Skipping vulnerability checks.
WARNING: No /usr/pkg/pkgdb/pkg-vulnerabilities file found.
WARNING: To fix run: `/usr/sbin/pkg_admin -K /usr/pkg/pkgdb fetch-pkg-vulnerabilities'.
===> Building for hashcat-6.2.6
cc -c -std=gnu99 -O2 -fPIC -D_FORTIFY_SOURCE=2 -I/usr/pkg/include -I/usr/include -pipe -Iinclude/ -IOpenCL/ -Ideps/LZMA-SDK/C -I/usr/pkg/include -I/usr/pkg/include/contrib -Ideps/OpenCL-Headers -DWITH_BRAIN -I/usr/pkg/include -DWITH_CUBIN -Ideps/unrar src/affinity.c -o obj/affinity.NATIVE.o -fpic
cc -c -std=gnu99 -O2 -fPIC -D_FORTIFY_SOURCE=2 -I/usr/pkg/include -I/usr/include -pipe -Iinclude/ -IOpenCL/ -Ideps/LZMA-SDK/C -I/usr/pkg/include -I/usr/pkg/include/contrib -Ideps/OpenCL-Headers -DWITH_BRAIN -I/usr/pkg/include -DWITH_CUBIN -Ideps/unrar src/autotune.c -o obj/autotune.NATIVE.o -fpic
cc -c -std=gnu99 -O2 -fPIC -D_FORTIFY_SOURCE=2 -I/usr/pkg/include -I/usr/include -pipe -Iinclude/ -IOpenCL/ -Ideps/LZMA-SDK/C -I/usr/pkg/include -I/usr/pkg/include/contrib -Ideps/OpenCL-Headers -DWITH_BRAIN -I/usr/pkg/include -DWITH_CUBIN -Ideps/unrar src/backend.c -o obj/backend.NATIVE.o -fpic
In file included from src/affinity.c:6:0:
include/common.h:21:2: error: #error "compiling for big-endian architecture not supported"
 #error "compiling for big-endian architecture not supported"
  ^~~~~
In file included from src/backend.c:6:0:
include/common.h:21:2: error: #error "compiling for big-endian architecture not supported"
 #error "compiling for big-endian architecture not supported"
  ^~~~~
In file included from src/autotune.c:6:0:
include/common.h:21:2: error: #error "compiling for big-endian architecture not supported"
 #error "compiling for big-endian architecture not supported"
  ^~~~~
distcc[24058] ERROR: compile src/affinity.c on 10.1.1.1:3642 failed
distcc[24058] (dcc_build_somewhere) Warning: remote compilation of 'src/affinity.c' failed, retrying locally
distcc[24058] Warning: failed to distribute src/affinity.c to 10.1.1.1:3642, running locally instead
In file included from src/affinity.c:6:0:
include/common.h:21:2: error: #error "compiling for big-endian architecture not supported"
 #error "compiling for big-endian architecture not supported"
  ^~~~~
distcc[16576] ERROR: compile src/backend.c on 10.1.1.1:3642 failed
distcc[16576] (dcc_build_somewhere) Warning: remote compilation of 'src/backend.c' failed, retrying locally
distcc[16576] Warning: failed to distribute src/backend.c to 10.1.1.1:3642, running locally instead
In file included from src/backend.c:6:0:
include/common.h:21:2: error: #error "compiling for big-endian architecture not supported"
 #error "compiling for big-endian architecture not supported"
  ^~~~~
distcc[2552] ERROR: compile src/autotune.c on 10.1.1.1:3642 failed
distcc[2552] (dcc_build_somewhere) Warning: remote compilation of 'src/autotune.c' failed, retrying locally
distcc[2552] Warning: failed to distribute src/autotune.c to 10.1.1.1:3642, running locally instead
In file included from src/autotune.c:6:0:
include/common.h:21:2: error: #error "compiling for big-endian architecture not supported"
 #error "compiling for big-endian architecture not supported"
  ^~~~~
src/backend.c: In function 'run_cracker':
src/backend.c:3751:41: warning: passing argument 2 of 'iconv' from incompatible pointer type [-Wincompatible-pointer-types]
                   if (iconv (iconv_ctx, &line_buf_new, &line_len, &iconv_ptr, &iconv_sz) == (size_t) -1) continue;
                                         ^
In file included from include/types.h:37:0,
                 from src/backend.c:7:
/usr/include/iconv.h:46:8: note: expected 'const char ** restrict' but argument is of type 'char **'
 size_t iconv(iconv_t, const char ** __restrict,
        ^~~~~
src/backend.c:3942:41: warning: passing argument 2 of 'iconv' from incompatible pointer type [-Wincompatible-pointer-types]
                   if (iconv (iconv_ctx, &line_buf_new, &line_len, &iconv_ptr, &iconv_sz) == (size_t) -1) continue;
                                         ^
In file included from include/types.h:37:0,
                 from src/backend.c:7:
/usr/include/iconv.h:46:8: note: expected 'const char ** restrict' but argument is of type 'char **'
 size_t iconv(iconv_t, const char ** __restrict,
        ^~~~~
distcc[24058] ERROR: compile src/affinity.c on localhost failed
gmake: *** [src/Makefile:604: obj/affinity.NATIVE.o] Error 1
gmake: *** Waiting for unfinished jobs....
distcc[2552] ERROR: compile src/autotune.c on localhost failed
gmake: *** [src/Makefile:604: obj/autotune.NATIVE.o] Error 1
distcc[16576] ERROR: compile src/backend.c on localhost failed
gmake: *** [src/Makefile:604: obj/backend.NATIVE.o] Error 1
*** Error code 2

Stop.
make[1]: stopped in /usr/pkgsrc/security/hashcat
*** Error code 1

Stop.
make: stopped in /usr/pkgsrc/security/hashcat