=> Bootstrap dependency digest>=20211023: found digest-20220214
===> Skipping vulnerability checks.
WARNING: No /usr/pkg/pkgdb/pkg-vulnerabilities file found.
WARNING: To fix run: `/usr/sbin/pkg_admin -K /usr/pkg/pkgdb fetch-pkg-vulnerabilities'.
===> Building for hercules4sdl-4.5nb1
/usr/pkg/bin/gmake  all-recursive
gmake[1]: Entering directory '/tmp/pkgbuild/emulators/hercules4sdl/work.sparc64/hyperion-Release_4.5'
Making all in m4
gmake[2]: Entering directory '/tmp/pkgbuild/emulators/hercules4sdl/work.sparc64/hyperion-Release_4.5/m4'
gmake[2]: Nothing to be done for 'all'.
gmake[2]: Leaving directory '/tmp/pkgbuild/emulators/hercules4sdl/work.sparc64/hyperion-Release_4.5/m4'
Making all in util
gmake[2]: Entering directory '/tmp/pkgbuild/emulators/hercules4sdl/work.sparc64/hyperion-Release_4.5/util'
gmake[2]: Nothing to be done for 'all'.
gmake[2]: Leaving directory '/tmp/pkgbuild/emulators/hercules4sdl/work.sparc64/hyperion-Release_4.5/util'
Making all in html
gmake[2]: Entering directory '/tmp/pkgbuild/emulators/hercules4sdl/work.sparc64/hyperion-Release_4.5/html'
gmake[2]: Nothing to be done for 'all'.
gmake[2]: Leaving directory '/tmp/pkgbuild/emulators/hercules4sdl/work.sparc64/hyperion-Release_4.5/html'
Making all in man
gmake[2]: Entering directory '/tmp/pkgbuild/emulators/hercules4sdl/work.sparc64/hyperion-Release_4.5/man'
gmake[2]: Nothing to be done for 'all'.
gmake[2]: Leaving directory '/tmp/pkgbuild/emulators/hercules4sdl/work.sparc64/hyperion-Release_4.5/man'
Making all in .
gmake[2]: Entering directory '/tmp/pkgbuild/emulators/hercules4sdl/work.sparc64/hyperion-Release_4.5'
  CC       cckdcdsk.o
  CC       hsys.lo
  CC       codepage.lo
  CC       hdl.lo
  CC       hexdumpe.lo
  CC       hostinfo.lo
  CC       hscutl.lo
  CC       hsocket.lo
  CC       hthreads.lo
hscutl.c: In function 'do_make_psw64':
hscutl.c:2003:12: warning: this statement may fall through [-Wimplicit-fallthrough=]
hscutl.c:2055:9: note: here
  CC       logger.lo
  CC       logmsg.lo
hthreads.c: In function 'locks_cmd':
hthreads.c:1295:31: warning: format '%lx' expects argument of type 'long unsigned int *', but argument 3 has type 'struct __pthread_st **' [-Wformat=]
hthreads.c: In function 'threads_cmd':
hthreads.c:1563:31: warning: format '%lx' expects argument of type 'long unsigned int *', but argument 3 has type 'struct __pthread_st **' [-Wformat=]
  CC       machdep.lo
  CC       memrchr.lo
  CC       parser.lo
  CC       pttrace.lo
  CC       version.lo
  CC       hetlib.lo
  CC       ftlib.lo
  CC       sllib.lo
  CC       cache.lo
  CC       cckddasd.lo
  CC       cckdutil.lo
cckddasd.c: In function 'cckd_trace':
cckddasd.c:6713:8: warning: format '%ld' expects argument of type 'long int', but argument 7 has type 'suseconds_t {aka int}' [-Wformat=]
  CC       ckddasd.lo
  CC       cckddasd64.lo
  CC       cckdutil64.lo
  CC       ckddasd64.lo
  CC       dasdtab.lo
  CC       dasdutil.lo
  CC       fbadasd.lo
  CC       dasdutil64.lo
  CC       fbadasd64.lo
  CC       shared.lo
  CC       _archdep_templ.lo
  CC       archlvl.lo
  CC       assist.lo
  CC       bldcfg.lo
  CC       cgibin.lo
In file included from assist.c:28:0:
inline.h:555:5: warning: 'Release_Interrupt_Lock' is static but used in inline function 's370_per1_gra' which is not static
inline.h:550:5: warning: 'Obtain_Interrupt_Lock' is static but used in inline function 's370_per1_gra' which is not static
  CC       channel.lo
  CC       chsc.lo
  CC       clock.lo
In file included from chsc.c:23:0:
inline.h:555:5: warning: 'Release_Interrupt_Lock' is static but used in inline function 's370_per1_gra' which is not static
inline.h:550:5: warning: 'Obtain_Interrupt_Lock' is static but used in inline function 's370_per1_gra' which is not static
In file included from channel.c:44:0:
inline.h:555:5: warning: 'Release_Interrupt_Lock' is static but used in inline function 's370_per1_gra' which is not static
inline.h:550:5: warning: 'Obtain_Interrupt_Lock' is static but used in inline function 's370_per1_gra' which is not static
In file included from clock.c:102:0:
inline.h:555:5: warning: 'Release_Interrupt_Lock' is static but used in inline function 's370_per1_gra' which is not static
inline.h:550:5: warning: 'Obtain_Interrupt_Lock' is static but used in inline function 's370_per1_gra' which is not static
  CC       cmdtab.lo
  CC       cmpsc_2012.lo
  CC       cmpscdbg.lo
  CC       cmpscdct.lo
In file included from cmpsc_2012.c:53:0:
inline.h:555:5: warning: 'Release_Interrupt_Lock' is static but used in inline function 's370_per1_gra' which is not static
inline.h:550:5: warning: 'Obtain_Interrupt_Lock' is static but used in inline function 's370_per1_gra' which is not static
  CC       cmpscget.lo
In file included from cmpscdct.c:16:0:
inline.h:555:5: warning: 'Release_Interrupt_Lock' is static but used in inline function 's370_per1_gra' which is not static
inline.h:550:5: warning: 'Obtain_Interrupt_Lock' is static but used in inline function 's370_per1_gra' which is not static
  CC       cmpscmem.lo
  CC       cmpscput.lo
In file included from cmpscmem.c:16:0:
inline.h:555:5: warning: 'Release_Interrupt_Lock' is static but used in inline function 's370_per1_gra' which is not static
inline.h:550:5: warning: 'Obtain_Interrupt_Lock' is static but used in inline function 's370_per1_gra' which is not static
  CC       config.lo
  CC       control.lo
  CC       cpu.lo
config.c: In function 'configure_cpu':
config.c:1079:14: warning: format '%d' expects argument of type 'int', but argument 8 has type 'long int' [-Wformat=]
  CC       crypto.lo
In file included from cpu.c:45:0:
inline.h:555:5: warning: 'Release_Interrupt_Lock' is static but used in inline function 's370_per1_gra' which is not static
inline.h:550:5: warning: 'Obtain_Interrupt_Lock' is static but used in inline function 's370_per1_gra' which is not static
In file included from control.c:46:0:
inline.h:555:5: warning: 'Release_Interrupt_Lock' is static but used in inline function 's370_per1_gra' which is not static
inline.h:550:5: warning: 'Obtain_Interrupt_Lock' is static but used in inline function 's370_per1_gra' which is not static
control.c: In function 's370_signal_processor':
control.c:6224:13: warning: this statement may fall through [-Wimplicit-fallthrough=]
control.c:6228:9: note: here
  CC       dat.lo
  CC       decimal.lo
In file included from dat.c:35:0:
inline.h:555:5: warning: 'Release_Interrupt_Lock' is static but used in inline function 's370_per1_gra' which is not static
inline.h:550:5: warning: 'Obtain_Interrupt_Lock' is static but used in inline function 's370_per1_gra' which is not static
In file included from dat.c:2601:0:
dat.c: In function 'z900_translate_addr':
dat.c:1360:20: warning: this statement may fall through [-Wimplicit-fallthrough=]
dat.c:1366:13: note: here
dat.c:1414:20: warning: this statement may fall through [-Wimplicit-fallthrough=]
dat.c:1420:13: note: here
In file included from decimal.c:38:0:
inline.h:555:5: warning: 'Release_Interrupt_Lock' is static but used in inline function 's370_per1_gra' which is not static
inline.h:550:5: warning: 'Obtain_Interrupt_Lock' is static but used in inline function 's370_per1_gra' which is not static
  CC       dfp.lo
  CC       diagmssf.lo
  CC       diagnose.lo
In file included from diagmssf.c:26:0:
inline.h:555:5: warning: 'Release_Interrupt_Lock' is static but used in inline function 's370_per1_gra' which is not static
inline.h:550:5: warning: 'Obtain_Interrupt_Lock' is static but used in inline function 's370_per1_gra' which is not static
In file included from dfp.c:21:0:
inline.h:555:5: warning: 'Release_Interrupt_Lock' is static but used in inline function 's370_per1_gra' which is not static
inline.h:550:5: warning: 'Obtain_Interrupt_Lock' is static but used in inline function 's370_per1_gra' which is not static
  CC       dyn76.lo
In file included from diagnose.c:27:0:
inline.h:555:5: warning: 'Release_Interrupt_Lock' is static but used in inline function 's370_per1_gra' which is not static
inline.h:550:5: warning: 'Obtain_Interrupt_Lock' is static but used in inline function 's370_per1_gra' which is not static
  CC       ecpsvm.lo
  CC       esame.lo
In file included from dyn76.c:23:0:
inline.h:555:5: warning: 'Release_Interrupt_Lock' is static but used in inline function 's370_per1_gra' which is not static
inline.h:550:5: warning: 'Obtain_Interrupt_Lock' is static but used in inline function 's370_per1_gra' which is not static
  CC       external.lo
In file included from ecpsvm.c:191:0:
inline.h:555:5: warning: 'Release_Interrupt_Lock' is static but used in inline function 's370_per1_gra' which is not static
inline.h:550:5: warning: 'Obtain_Interrupt_Lock' is static but used in inline function 's370_per1_gra' which is not static
In file included from external.c:37:0:
inline.h:555:5: warning: 'Release_Interrupt_Lock' is static but used in inline function 's370_per1_gra' which is not static
inline.h:550:5: warning: 'Obtain_Interrupt_Lock' is static but used in inline function 's370_per1_gra' which is not static
In file included from esame.c:32:0:
inline.h:555:5: warning: 'Release_Interrupt_Lock' is static but used in inline function 's370_per1_gra' which is not static
inline.h:550:5: warning: 'Obtain_Interrupt_Lock' is static but used in inline function 's370_per1_gra' which is not static
  CC       facility.lo
  CC       fillfnam.lo
fillfnam.c: In function 'tab_pressed':
fillfnam.c:146:32: warning: passing argument 3 of 'scandir' from incompatible pointer type [-Wincompatible-pointer-types]
In file included from hstdinc.h:215:0,
                 from fillfnam.c:8:
/usr/include/dirent.h:111:5: note: expected 'int (*)(const struct dirent *)' but argument is of type 'int (*)(struct dirent *)'
 int scandir(const char *, struct dirent ***,
     ^~~~~~~
  CC       float.lo
  CC       general1.lo
  CC       general2.lo
In file included from float.c:43:0:
inline.h:555:5: warning: 'Release_Interrupt_Lock' is static but used in inline function 's370_per1_gra' which is not static
inline.h:550:5: warning: 'Obtain_Interrupt_Lock' is static but used in inline function 's370_per1_gra' which is not static
In file included from general2.c:44:0:
inline.h:555:5: warning: 'Release_Interrupt_Lock' is static but used in inline function 's370_per1_gra' which is not static
inline.h:550:5: warning: 'Obtain_Interrupt_Lock' is static but used in inline function 's370_per1_gra' which is not static
  CC       general3.lo
In file included from general1.c:43:0:
inline.h:555:5: warning: 'Release_Interrupt_Lock' is static but used in inline function 's370_per1_gra' which is not static
inline.h:550:5: warning: 'Obtain_Interrupt_Lock' is static but used in inline function 's370_per1_gra' which is not static
general1.c: In function 's370_compare_logical_character':
general1.c:3303:20: warning: this statement may fall through [-Wimplicit-fallthrough=]
general1.c:3313:13: note: here
In file included from general1.c:7452:0:
general1.c: In function 's390_compare_logical_character':
general1.c:3303:20: warning: this statement may fall through [-Wimplicit-fallthrough=]
general1.c:3313:13: note: here
In file included from general1.c:7458:0:
general1.c: In function 'z900_compare_logical_character':
general1.c:3303:20: warning: this statement may fall through [-Wimplicit-fallthrough=]
general1.c:3313:13: note: here
  CC       hao.lo
In file included from general3.c:22:0:
inline.h:555:5: warning: 'Release_Interrupt_Lock' is static but used in inline function 's370_per1_gra' which is not static
inline.h:550:5: warning: 'Obtain_Interrupt_Lock' is static but used in inline function 's370_per1_gra' which is not static
  CC       hbyteswp.lo
  CC       hconsole.lo
  CC       hdiagf18.lo
In file included from hdiagf18.c:49:0:
inline.h:555:5: warning: 'Release_Interrupt_Lock' is static but used in inline function 's370_per1_gra' which is not static
inline.h:550:5: warning: 'Obtain_Interrupt_Lock' is static but used in inline function 's370_per1_gra' which is not static
  CC       history.lo
  CC       hRexx.lo
  CC       hRexx_o.lo
  CC       hRexx_r.lo
  CC       hsccmd.lo
  CC       hscemode.lo
  CC       hscloc.lo
hsccmd.c: In function 'qproc_cmd':
hsccmd.c:9105:28: warning: cast from pointer to integer of different size [-Wpointer-to-int-cast]
In file included from hsccmd.c:69:0:
hsccmd.c: At top level:
inline.h:555:5: warning: 'Release_Interrupt_Lock' is static but used in inline function 's370_per1_gra' which is not static
inline.h:550:5: warning: 'Obtain_Interrupt_Lock' is static but used in inline function 's370_per1_gra' which is not static
  CC       hscmisc.lo
  CC       hscpufun.lo
In file included from hscmisc.c:18:0:
inline.h:555:5: warning: 'Release_Interrupt_Lock' is static but used in inline function 's370_per1_gra' which is not static
inline.h:550:5: warning: 'Obtain_Interrupt_Lock' is static but used in inline function 's370_per1_gra' which is not static
  CC       httpserv.lo
  CC       ieee.lo
  CC       impl.lo
  CC       inline.lo
  CC       io.lo
In file included from ieee.c:111:0:
inline.h:555:5: warning: 'Release_Interrupt_Lock' is static but used in inline function 's370_per1_gra' which is not static
inline.h:550:5: warning: 'Obtain_Interrupt_Lock' is static but used in inline function 's370_per1_gra' which is not static
  CC       ipl.lo
In file included from io.c:45:0:
inline.h:555:5: warning: 'Release_Interrupt_Lock' is static but used in inline function 's370_per1_gra' which is not static
inline.h:550:5: warning: 'Obtain_Interrupt_Lock' is static but used in inline function 's370_per1_gra' which is not static
In file included from ipl.c:29:0:
inline.h:555:5: warning: 'Release_Interrupt_Lock' is static but used in inline function 's370_per1_gra' which is not static
inline.h:550:5: warning: 'Obtain_Interrupt_Lock' is static but used in inline function 's370_per1_gra' which is not static
  CC       loadmem.lo
  CC       loadparm.lo
  CC       losc.lo
  CC       machchk.lo
  CC       opcode.lo
  CC       panel.lo
  CC       pfpo.lo
opcode.c: In function 's370_operation_exception':
opcode.c:1414:103: warning: ?: using integer constants in boolean context [-Wint-in-bool-context]
opcode.c: In function 'operation_exception':
opcode.c:1429:103: warning: ?: using integer constants in boolean context [-Wint-in-bool-context]
In file included from opcode.c:1779:0:
opcode.c: In function 's390_operation_exception':
opcode.c:1414:103: warning: ?: using integer constants in boolean context [-Wint-in-bool-context]
In file included from opcode.c:1785:0:
opcode.c: In function 'z900_operation_exception':
opcode.c:1414:103: warning: ?: using integer constants in boolean context [-Wint-in-bool-context]
  CC       plo.lo
  CC       qdio.lo
In file included from plo.c:18:0:
inline.h:555:5: warning: 'Release_Interrupt_Lock' is static but used in inline function 's370_per1_gra' which is not static
inline.h:550:5: warning: 'Obtain_Interrupt_Lock' is static but used in inline function 's370_per1_gra' which is not static
  CC       scedasd.lo
  CC       scescsi.lo
In file included from qdio.c:20:0:
inline.h:555:5: warning: 'Release_Interrupt_Lock' is static but used in inline function 's370_per1_gra' which is not static
inline.h:550:5: warning: 'Obtain_Interrupt_Lock' is static but used in inline function 's370_per1_gra' which is not static
In file included from scedasd.c:14:0:
inline.h:555:5: warning: 'Release_Interrupt_Lock' is static but used in inline function 's370_per1_gra' which is not static
inline.h:550:5: warning: 'Obtain_Interrupt_Lock' is static but used in inline function 's370_per1_gra' which is not static
  CC       script.lo
  CC       service.lo
In file included from scescsi.c:18:0:
inline.h:555:5: warning: 'Release_Interrupt_Lock' is static but used in inline function 's370_per1_gra' which is not static
inline.h:550:5: warning: 'Obtain_Interrupt_Lock' is static but used in inline function 's370_per1_gra' which is not static
  CC       sie.lo
In file included from service.c:35:0:
inline.h:555:5: warning: 'Release_Interrupt_Lock' is static but used in inline function 's370_per1_gra' which is not static
inline.h:550:5: warning: 'Obtain_Interrupt_Lock' is static but used in inline function 's370_per1_gra' which is not static
  CC       skey.lo
In file included from skey.c:15:0:
inline.h:555:5: warning: 'Release_Interrupt_Lock' is static but used in inline function 's370_per1_gra' which is not static
inline.h:550:5: warning: 'Obtain_Interrupt_Lock' is static but used in inline function 's370_per1_gra' which is not static
  CC       sr.lo
In file included from sie.c:24:0:
inline.h:555:5: warning: 'Release_Interrupt_Lock' is static but used in inline function 's370_per1_gra' which is not static
inline.h:550:5: warning: 'Obtain_Interrupt_Lock' is static but used in inline function 's370_per1_gra' which is not static
In file included from sie.c:2067:0:
sie.c: In function 's390_sie_exit':
sie.c:1500:61: warning: this statement may fall through [-Wimplicit-fallthrough=]
sie.c:1502:9: note: here
In file included from sie.c:2073:0:
sie.c: In function 'z900_sie_exit':
sie.c:1500:61: warning: this statement may fall through [-Wimplicit-fallthrough=]
sie.c:1502:9: note: here
  CC       stack.lo
  CC       strsignal.lo
  CC       tcpip.lo
In file included from stack.c:39:0:
inline.h:555:5: warning: 'Release_Interrupt_Lock' is static but used in inline function 's370_per1_gra' which is not static
inline.h:550:5: warning: 'Obtain_Interrupt_Lock' is static but used in inline function 's370_per1_gra' which is not static
  CC       timer.lo
  CC       trace.lo
  CC       transact.lo
In file included from trace.c:30:0:
inline.h:555:5: warning: 'Release_Interrupt_Lock' is static but used in inline function 's370_per1_gra' which is not static
inline.h:550:5: warning: 'Obtain_Interrupt_Lock' is static but used in inline function 's370_per1_gra' which is not static
  CC       vector.lo
In file included from transact.c:43:0:
inline.h:555:5: warning: 'Release_Interrupt_Lock' is static but used in inline function 's370_per1_gra' which is not static
inline.h:550:5: warning: 'Obtain_Interrupt_Lock' is static but used in inline function 's370_per1_gra' which is not static
In file included from transact.c:1811:0:
transact.c: In function 'z900_process_tbegin':
transact.c:870:20: warning: this statement may fall through [-Wimplicit-fallthrough=]
transact.c:876:13: note: here
  CC       vm.lo
  CC       vmd250.lo
  CC       vstore.lo
In file included from vm.c:26:0:
inline.h:555:5: warning: 'Release_Interrupt_Lock' is static but used in inline function 's370_per1_gra' which is not static
inline.h:550:5: warning: 'Obtain_Interrupt_Lock' is static but used in inline function 's370_per1_gra' which is not static
In file included from vmd250.c:94:0:
inline.h:555:5: warning: 'Release_Interrupt_Lock' is static but used in inline function 's370_per1_gra' which is not static
inline.h:550:5: warning: 'Obtain_Interrupt_Lock' is static but used in inline function 's370_per1_gra' which is not static
In file included from vstore.c:64:0:
inline.h:555:5: warning: 'Release_Interrupt_Lock' is static but used in inline function 's370_per1_gra' which is not static
inline.h:550:5: warning: 'Obtain_Interrupt_Lock' is static but used in inline function 's370_per1_gra' which is not static
  CC       x75.lo
  CC       xstore.lo
In file included from x75.c:64:0:
inline.h:555:5: warning: 'Release_Interrupt_Lock' is static but used in inline function 's370_per1_gra' which is not static
inline.h:550:5: warning: 'Obtain_Interrupt_Lock' is static but used in inline function 's370_per1_gra' which is not static
  CC       tapedev.lo
In file included from xstore.c:25:0:
inline.h:555:5: warning: 'Release_Interrupt_Lock' is static but used in inline function 's370_per1_gra' which is not static
inline.h:550:5: warning: 'Obtain_Interrupt_Lock' is static but used in inline function 's370_per1_gra' which is not static
  CC       tapeccws.lo
  CC       awstape.lo
tapedev.c: In function 'mountnewtape':
tapedev.c:1346:13: warning: suggest braces around empty body in an 'else' statement [-Wempty-body]
tapeccws.c: In function 'tapedev_execute_ccw':
tapeccws.c:695:12: warning: this statement may fall through [-Wimplicit-fallthrough=]
tapeccws.c:735:5: note: here
  CC       faketape.lo
  CC       hettape.lo
  CC       omatape.lo
  CC       scsitape.lo
  CC       scsiutil.lo
  CC       cckdcomp.o
  CC       cckddiag.o
  CC       cckdswap.o
  CC       cckdcdsk64.o
  CC       cckdcomp64.o
  CC       cckddiag64.o
  CC       cckdswap64.o
  CC       convto64.o
  CC       cckdmap.o
  CC       dasdcat.o
  CC       dasdconv.o
  CC       dasdcopy.o
  CC       dasdinit.o
  CC       dasdconv64.o
  CC       dasdcopy64.o
  CC       dasdinit64.o
  CC       dasdisup.o
  CC       dasdload.o
  CC       dasdload64.o
  CC       dasdls.o
  CC       dasdpdsu.o
dasdls.c: In function 'chainf3':
dasdls.c:292:31: warning: this statement may fall through [-Wimplicit-fallthrough=]
dasdls.c:298:17: note: here
  CC       dasdseq.o
  CC       dasdser.o
  CC       dmap2hrc.o
  CC       bootstrap.o
  CC       hetget.o
  CC       hetinit.o
  CC       hetmap.o
  CC       hetupd.o
  CC       maketape.o
  CC       tapecopy-tapecopy.o
  CC       tapecopy-scsiutil.o
  CC       tapemap.o
  CC       tapesplt.o
  CC       vmfplc2.o
  CC       hercifc.o
  CC       herclin.o
  CC       dyncrypt.lo
  CC       dyngui.lo
  CC       hdteq.lo
In file included from dyncrypt.c:5055:0:
dyncrypt.c: In function 's390_dyn_perform_cryptographic_key_management_operation':
dyncrypt.c:5037:194: warning: ?: using integer constants in boolean context [-Wint-in-bool-context]
dyncrypt.c: In function 's390_dyn_perform_cryptographic_computation':
dyncrypt.c:5041:181: warning: ?: using integer constants in boolean context [-Wint-in-bool-context]
dyncrypt.c: In function 's390_dyn_cipher_message_with_cipher_feedback':
dyncrypt.c:5042:183: warning: ?: using integer constants in boolean context [-Wint-in-bool-context]
dyncrypt.c: In function 's390_dyn_cipher_message_with_output_feedback':
dyncrypt.c:5043:183: warning: ?: using integer constants in boolean context [-Wint-in-bool-context]
dyncrypt.c: In function 's390_dyn_cipher_message_with_counter':
dyncrypt.c:5044:175: warning: ?: using integer constants in boolean context [-Wint-in-bool-context]
In file included from dyncrypt.c:25:0:
dyncrypt.c: At top level:
inline.h:555:5: warning: 'Release_Interrupt_Lock' is static but used in inline function 's370_per1_gra' which is not static
inline.h:550:5: warning: 'Obtain_Interrupt_Lock' is static but used in inline function 's370_per1_gra' which is not static
  CC       ctc_ptp.lo
  CC       mpc.lo
  CC       resolve.lo
  CC       tuntap.lo
  CC       qeth.lo
  CC       zfcp.lo
  CC       con1052c.lo
In file included from zfcp.c:44:0:
inline.h:555:5: warning: 'Release_Interrupt_Lock' is static but used in inline function 's370_per1_gra' which is not static
inline.h:550:5: warning: 'Obtain_Interrupt_Lock' is static but used in inline function 's370_per1_gra' which is not static
In file included from qeth.c:124:0:
inline.h:555:5: warning: 'Release_Interrupt_Lock' is static but used in inline function 's370_per1_gra' which is not static
inline.h:550:5: warning: 'Obtain_Interrupt_Lock' is static but used in inline function 's370_per1_gra' which is not static
  CC       printer.lo
  CC       sockdev.lo
  CC       commadpt.lo
printer.c: In function 'printer_execute_ccw':
printer.c:1945:12: warning: this statement may fall through [-Wimplicit-fallthrough=]
printer.c:1959:5: note: here
  CC       tcpnje.lo
commadpt.c: In function 'commadpt_thread':
commadpt.c:1536:19: warning: this statement may fall through [-Wimplicit-fallthrough=]
commadpt.c:1546:13: note: here
  CC       comm3705.lo
tcpnje.c: In function 'tcpnje_thread':
tcpnje.c:1458:75: warning: format '%lx' expects argument of type 'long unsigned int', but argument 3 has type 'pthread_t {aka struct __pthread_st *}' [-Wformat=]
tcpnje.c:1847:87: warning: format '%ld' expects argument of type 'long int', but argument 4 has type 'suseconds_t {aka int}' [-Wformat=]
tcpnje.c: In function 'tcpnje_execute_ccw':
tcpnje.c:4245:60: warning: this statement may fall through [-Wimplicit-fallthrough=]
tcpnje.c:4249:9: note: here
  CC       ctc_lcs.lo
  CC       ctc_ctci.lo
  CC       ctcadpt.lo
  CC       netsupp.lo
  CC       console.lo
  CC       cardrdr.lo
  CC       hchan.lo
cardrdr.c: In function 'cardrdr_execute_ccw':
cardrdr.c:933:12: warning: this statement may fall through [-Wimplicit-fallthrough=]
cardrdr.c:949:5: note: here
  CC       dummydev.lo
  CC       cardpch.lo
  CCLD     libhercs.la

*** Warning: linker path does not have real file for library -lcrypto_pic.
*** I have the capability to make that library automatically link in when
*** you link to this library.  But I can only do this if you have a
*** shared version of the library, which you do not appear to have
*** because I did check the linker path looking for a file starting
*** with libcrypto_pic and none of the candidates passed a file format test
*** using a regex pattern. Last file checked: /usr/lib/libz.so

*** Warning: linker path does not have real file for library -ldecNumber_pic.
*** I have the capability to make that library automatically link in when
*** you link to this library.  But I can only do this if you have a
*** shared version of the library, which you do not appear to have
*** because I did check the linker path looking for a file starting
*** with libdecNumber_pic and none of the candidates passed a file format test
*** using a regex pattern. Last file checked: /usr/lib/libz.so

*** Warning: linker path does not have real file for library -lSoftFloat_pic.
*** I have the capability to make that library automatically link in when
*** you link to this library.  But I can only do this if you have a
*** shared version of the library, which you do not appear to have
*** because I did check the linker path looking for a file starting
*** with libSoftFloat_pic and none of the candidates passed a file format test
*** using a regex pattern. Last file checked: /usr/lib/libz.so

*** Warning: linker path does not have real file for library -ltelnet_pic.
*** I have the capability to make that library automatically link in when
*** you link to this library.  But I can only do this if you have a
*** shared version of the library, which you do not appear to have
*** because I did check the linker path looking for a file starting
*** with libtelnet_pic and none of the candidates passed a file format test
*** using a regex pattern. Last file checked: /usr/lib/libz.so
*** The inter-library dependencies that have been dropped here will be
*** automatically added whenever a program is linked with this library
*** or is declared to -dlopen it.

*** Since this library must not contain undefined symbols,
*** because either the platform does not support them or
*** it was explicitly requested with -no-undefined,
*** libtool will only create a static version of it.
  CCLD     libhercu.la

*** Warning: This system cannot link to static lib archive libhercs.la.
*** I have the capability to make that library automatically link in when
*** you link to this library.  But I can only do this if you have a
*** shared version of the library, which you do not appear to have.

*** Warning: linker path does not have real file for library -lcrypto_pic.
*** I have the capability to make that library automatically link in when
*** you link to this library.  But I can only do this if you have a
*** shared version of the library, which you do not appear to have
*** because I did check the linker path looking for a file starting
*** with libcrypto_pic and none of the candidates passed a file format test
*** using a regex pattern. Last file checked: /usr/lib/libz.so

*** Warning: linker path does not have real file for library -ldecNumber_pic.
*** I have the capability to make that library automatically link in when
*** you link to this library.  But I can only do this if you have a
*** shared version of the library, which you do not appear to have
*** because I did check the linker path looking for a file starting
*** with libdecNumber_pic and none of the candidates passed a file format test
*** using a regex pattern. Last file checked: /usr/lib/libz.so

*** Warning: linker path does not have real file for library -lSoftFloat_pic.
*** I have the capability to make that library automatically link in when
*** you link to this library.  But I can only do this if you have a
*** shared version of the library, which you do not appear to have
*** because I did check the linker path looking for a file starting
*** with libSoftFloat_pic and none of the candidates passed a file format test
*** using a regex pattern. Last file checked: /usr/lib/libz.so

*** Warning: linker path does not have real file for library -ltelnet_pic.
*** I have the capability to make that library automatically link in when
*** you link to this library.  But I can only do this if you have a
*** shared version of the library, which you do not appear to have
*** because I did check the linker path looking for a file starting
*** with libtelnet_pic and none of the candidates passed a file format test
*** using a regex pattern. Last file checked: /usr/lib/libz.so
*** The inter-library dependencies that have been dropped here will be
*** automatically added whenever a program is linked with this library
*** or is declared to -dlopen it.

*** Since this library must not contain undefined symbols,
*** because either the platform does not support them or
*** it was explicitly requested with -no-undefined,
*** libtool will only create a static version of it.
  CCLD     libherct.la
  CCLD     libhercd.la

*** Warning: This system cannot link to static lib archive libhercs.la.
*** I have the capability to make that library automatically link in when
*** you link to this library.  But I can only do this if you have a
*** shared version of the library, which you do not appear to have.

*** Warning: This system cannot link to static lib archive libhercu.la.
*** I have the capability to make that library automatically link in when
*** you link to this library.  But I can only do this if you have a
*** shared version of the library, which you do not appear to have.

*** Warning: This system cannot link to static lib archive libhercs.la.
*** I have the capability to make that library automatically link in when
*** you link to this library.  But I can only do this if you have a
*** shared version of the library, which you do not appear to have.

*** Warning: This system cannot link to static lib archive /tmp/pkgbuild/emulators/hercules4sdl/work.sparc64/hyperion-Release_4.5/libhercs.la.
*** I have the capability to make that library automatically link in when
*** you link to this library.  But I can only do this if you have a
*** shared version of the library, which you do not appear to have.

*** Warning: This system cannot link to static lib archive libhercu.la.
*** I have the capability to make that library automatically link in when
*** you link to this library.  But I can only do this if you have a
*** shared version of the library, which you do not appear to have.

*** Warning: This system cannot link to static lib archive /tmp/pkgbuild/emulators/hercules4sdl/work.sparc64/hyperion-Release_4.5/libhercs.la.
*** I have the capability to make that library automatically link in when
*** you link to this library.  But I can only do this if you have a
*** shared version of the library, which you do not appear to have.

*** Warning: linker path does not have real file for library -lcrypto_pic.
*** I have the capability to make that library automatically link in when
*** you link to this library.  But I can only do this if you have a
*** shared version of the library, which you do not appear to have
*** because I did check the linker path looking for a file starting
*** with libcrypto_pic and none of the candidates passed a file format test
*** using a regex pattern. Last file checked: /usr/lib/libz.so

*** Warning: linker path does not have real file for library -ldecNumber_pic.
*** I have the capability to make that library automatically link in when
*** you link to this library.  But I can only do this if you have a
*** shared version of the library, which you do not appear to have
*** because I did check the linker path looking for a file starting
*** with libdecNumber_pic and none of the candidates passed a file format test
*** using a regex pattern. Last file checked: /usr/lib/libz.so

*** Warning: linker path does not have real file for library -lSoftFloat_pic.
*** I have the capability to make that library automatically link in when
*** you link to this library.  But I can only do this if you have a
*** shared version of the library, which you do not appear to have
*** because I did check the linker path looking for a file starting
*** with libSoftFloat_pic and none of the candidates passed a file format test
*** using a regex pattern. Last file checked: /usr/lib/libz.so

*** Warning: linker path does not have real file for library -ltelnet_pic.
*** I have the capability to make that library automatically link in when
*** you link to this library.  But I can only do this if you have a
*** shared version of the library, which you do not appear to have
*** because I did check the linker path looking for a file starting
*** with libtelnet_pic and none of the candidates passed a file format test
*** using a regex pattern. Last file checked: /usr/lib/libz.so
*** The inter-library dependencies that have been dropped here will be
*** automatically added whenever a program is linked with this library
*** or is declared to -dlopen it.

*** Since this library must not contain undefined symbols,
*** because either the platform does not support them or
*** it was explicitly requested with -no-undefined,
*** libtool will only create a static version of it.

*** Warning: linker path does not have real file for library -lcrypto_pic.
*** I have the capability to make that library automatically link in when
*** you link to this library.  But I can only do this if you have a
*** shared version of the library, which you do not appear to have
*** because I did check the linker path looking for a file starting
*** with libcrypto_pic and none of the candidates passed a file format test
*** using a regex pattern. Last file checked: /usr/lib/libz.so

*** Warning: linker path does not have real file for library -ldecNumber_pic.
*** I have the capability to make that library automatically link in when
*** you link to this library.  But I can only do this if you have a
*** shared version of the library, which you do not appear to have
*** because I did check the linker path looking for a file starting
*** with libdecNumber_pic and none of the candidates passed a file format test
*** using a regex pattern. Last file checked: /usr/lib/libz.so

*** Warning: linker path does not have real file for library -lSoftFloat_pic.
*** I have the capability to make that library automatically link in when
*** you link to this library.  But I can only do this if you have a
*** shared version of the library, which you do not appear to have
*** because I did check the linker path looking for a file starting
*** with libSoftFloat_pic and none of the candidates passed a file format test
*** using a regex pattern. Last file checked: /usr/lib/libz.so

*** Warning: linker path does not have real file for library -ltelnet_pic.
*** I have the capability to make that library automatically link in when
*** you link to this library.  But I can only do this if you have a
*** shared version of the library, which you do not appear to have
*** because I did check the linker path looking for a file starting
*** with libtelnet_pic and none of the candidates passed a file format test
*** using a regex pattern. Last file checked: /usr/lib/libz.so
*** The inter-library dependencies that have been dropped here will be
*** automatically added whenever a program is linked with this library
*** or is declared to -dlopen it.

*** Since this library must not contain undefined symbols,
*** because either the platform does not support them or
*** it was explicitly requested with -no-undefined,
*** libtool will only create a static version of it.
  CCLD     libherc.la

*** Warning: This system cannot link to static lib archive libhercs.la.
*** I have the capability to make that library automatically link in when
*** you link to this library.  But I can only do this if you have a
*** shared version of the library, which you do not appear to have.

*** Warning: This system cannot link to static lib archive libhercu.la.
*** I have the capability to make that library automatically link in when
*** you link to this library.  But I can only do this if you have a
*** shared version of the library, which you do not appear to have.

*** Warning: This system cannot link to static lib archive libherct.la.
*** I have the capability to make that library automatically link in when
*** you link to this library.  But I can only do this if you have a
*** shared version of the library, which you do not appear to have.

*** Warning: This system cannot link to static lib archive libhercd.la.
*** I have the capability to make that library automatically link in when
*** you link to this library.  But I can only do this if you have a
*** shared version of the library, which you do not appear to have.

*** Warning: This system cannot link to static lib archive /tmp/pkgbuild/emulators/hercules4sdl/work.sparc64/hyperion-Release_4.5/libhercu.la.
*** I have the capability to make that library automatically link in when
*** you link to this library.  But I can only do this if you have a
*** shared version of the library, which you do not appear to have.

*** Warning: This system cannot link to static lib archive /tmp/pkgbuild/emulators/hercules4sdl/work.sparc64/hyperion-Release_4.5/libhercs.la.
*** I have the capability to make that library automatically link in when
*** you link to this library.  But I can only do this if you have a
*** shared version of the library, which you do not appear to have.

*** Warning: linker path does not have real file for library -lcrypto_pic.
*** I have the capability to make that library automatically link in when
*** you link to this library.  But I can only do this if you have a
*** shared version of the library, which you do not appear to have
*** because I did check the linker path looking for a file starting
*** with libcrypto_pic and none of the candidates passed a file format test
*** using a regex pattern. Last file checked: /usr/lib/libz.so

*** Warning: linker path does not have real file for library -ldecNumber_pic.
*** I have the capability to make that library automatically link in when
*** you link to this library.  But I can only do this if you have a
*** shared version of the library, which you do not appear to have
*** because I did check the linker path looking for a file starting
*** with libdecNumber_pic and none of the candidates passed a file format test
*** using a regex pattern. Last file checked: /usr/lib/libz.so

*** Warning: linker path does not have real file for library -lSoftFloat_pic.
*** I have the capability to make that library automatically link in when
*** you link to this library.  But I can only do this if you have a
*** shared version of the library, which you do not appear to have
*** because I did check the linker path looking for a file starting
*** with libSoftFloat_pic and none of the candidates passed a file format test
*** using a regex pattern. Last file checked: /usr/lib/libz.so

*** Warning: linker path does not have real file for library -ltelnet_pic.
*** I have the capability to make that library automatically link in when
*** you link to this library.  But I can only do this if you have a
*** shared version of the library, which you do not appear to have
*** because I did check the linker path looking for a file starting
*** with libtelnet_pic and none of the candidates passed a file format test
*** using a regex pattern. Last file checked: /usr/lib/libz.so
*** The inter-library dependencies that have been dropped here will be
*** automatically added whenever a program is linked with this library
*** or is declared to -dlopen it.

*** Since this library must not contain undefined symbols,
*** because either the platform does not support them or
*** it was explicitly requested with -no-undefined,
*** libtool will only create a static version of it.
  CCLD     libhdt3420_not_mod.la
  CCLD     hercules
  CCLD     herclin

*** Warning: This system cannot link to static lib archive libhercs.la.
*** I have the capability to make that library automatically link in when
*** you link to this library.  But I can only do this if you have a
*** shared version of the library, which you do not appear to have.

*** Warning: This system cannot link to static lib archive libhercu.la.
*** I have the capability to make that library automatically link in when
*** you link to this library.  But I can only do this if you have a
*** shared version of the library, which you do not appear to have.

*** Warning: This system cannot link to static lib archive libherc.la.
*** I have the capability to make that library automatically link in when
*** you link to this library.  But I can only do this if you have a
*** shared version of the library, which you do not appear to have.

*** Warning: This system cannot link to static lib archive /tmp/pkgbuild/emulators/hercules4sdl/work.sparc64/hyperion-Release_4.5/libherct.la.
*** I have the capability to make that library automatically link in when
*** you link to this library.  But I can only do this if you have a
*** shared version of the library, which you do not appear to have.

*** Warning: This system cannot link to static lib archive /tmp/pkgbuild/emulators/hercules4sdl/work.sparc64/hyperion-Release_4.5/libhercd.la.
*** I have the capability to make that library automatically link in when
*** you link to this library.  But I can only do this if you have a
*** shared version of the library, which you do not appear to have.

*** Warning: This system cannot link to static lib archive libherct.la.
*** I have the capability to make that library automatically link in when
*** you link to this library.  But I can only do this if you have a
*** shared version of the library, which you do not appear to have.

*** Warning: This system cannot link to static lib archive /tmp/pkgbuild/emulators/hercules4sdl/work.sparc64/hyperion-Release_4.5/libhercu.la.
*** I have the capability to make that library automatically link in when
*** you link to this library.  But I can only do this if you have a
*** shared version of the library, which you do not appear to have.

*** Warning: This system cannot link to static lib archive /tmp/pkgbuild/emulators/hercules4sdl/work.sparc64/hyperion-Release_4.5/libhercs.la.
*** I have the capability to make that library automatically link in when
*** you link to this library.  But I can only do this if you have a
*** shared version of the library, which you do not appear to have.

*** Warning: linker path does not have real file for library -lcrypto_pic.
*** I have the capability to make that library automatically link in when
*** you link to this library.  But I can only do this if you have a
*** shared version of the library, which you do not appear to have
*** because I did check the linker path looking for a file starting
*** with libcrypto_pic and none of the candidates passed a file format test
*** using a regex pattern. Last file checked: /usr/lib/libz.so

*** Warning: linker path does not have real file for library -ldecNumber_pic.
*** I have the capability to make that library automatically link in when
*** you link to this library.  But I can only do this if you have a
*** shared version of the library, which you do not appear to have
*** because I did check the linker path looking for a file starting
*** with libdecNumber_pic and none of the candidates passed a file format test
*** using a regex pattern. Last file checked: /usr/lib/libz.so

*** Warning: linker path does not have real file for library -lSoftFloat_pic.
*** I have the capability to make that library automatically link in when
*** you link to this library.  But I can only do this if you have a
*** shared version of the library, which you do not appear to have
*** because I did check the linker path looking for a file starting
*** with libSoftFloat_pic and none of the candidates passed a file format test
*** using a regex pattern. Last file checked: /usr/lib/libz.so

*** Warning: linker path does not have real file for library -ltelnet_pic.
*** I have the capability to make that library automatically link in when
*** you link to this library.  But I can only do this if you have a
*** shared version of the library, which you do not appear to have
*** because I did check the linker path looking for a file starting
*** with libtelnet_pic and none of the candidates passed a file format test
*** using a regex pattern. Last file checked: /usr/lib/libz.so
*** The inter-library dependencies that have been dropped here will be
*** automatically added whenever a program is linked with this library
*** or is declared to -dlopen it.

*** Since this library must not contain undefined symbols,
*** because either the platform does not support them or
*** it was explicitly requested with -no-undefined,
*** libtool will only create a static version of it.
  CCLD     dyncrypt.la

*** Warning: This system cannot link to static lib archive libherc.la.
*** I have the capability to make that library automatically link in when
*** you link to this library.  But I can only do this if you have a
*** shared version of the library, which you do not appear to have.
*** But as you try to build a module library, libtool will still create 
*** a static module, that should work as long as the dlopening application
*** is linked with the -dlopen flag to resolve symbols at runtime.
ld: cannot find -lcrypto_pic
ld: cannot find -ldecNumber_pic
ld: cannot find -lSoftFloat_pic
ld: cannot find -ltelnet_pic
ld: cannot find -lcrypto_pic
ld: cannot find -ldecNumber_pic
ld: cannot find -lSoftFloat_pic
ld: cannot find -ltelnet_pic
ld: /usr/lib/libc.so and /usr/lib/crt0.o: warning: multiple common of `environ'
ld: /usr/lib/libc.so and /usr/lib/crt0.o: warning: multiple common of `environ'
distcc[18977] ERROR: compile (null) on localhost failed
distcc[23029] ERROR: compile (null) on localhost failed
gmake[2]: *** [Makefile:2325: herclin] Error 1
gmake[2]: *** Waiting for unfinished jobs....
gmake[2]: *** [Makefile:2329: hercules] Error 1
gmake[2]: Leaving directory '/tmp/pkgbuild/emulators/hercules4sdl/work.sparc64/hyperion-Release_4.5'
gmake[1]: *** [Makefile:2628: all-recursive] Error 1
gmake[1]: Leaving directory '/tmp/pkgbuild/emulators/hercules4sdl/work.sparc64/hyperion-Release_4.5'
gmake: *** [Makefile:1964: all] Error 2
*** Error code 2

Stop.
make[1]: stopped in /usr/pkgsrc/emulators/hercules4sdl
*** Error code 1

Stop.
make: stopped in /usr/pkgsrc/emulators/hercules4sdl