=> Bootstrap dependency digest>=20211023: found digest-20220214
===> Skipping vulnerability checks.
WARNING: No /usr/pkg/pkgdb/pkg-vulnerabilities file found.
WARNING: To fix run: `/usr/sbin/pkg_admin -K /usr/pkg/pkgdb fetch-pkg-vulnerabilities'.
===> Building for lepton-1.2.1
/usr/pkg/bin/gmake  all-am
gmake[1]: Entering directory '/tmp/pkgbuild/graphics/lepton/work.sparc64/lepton-911d79a560c303a2a62e5412117d0a4ccb41836d'
depbase=`echo src/io/MemReadWriter.o | sed 's|[^/]*$|.deps/&|;s|\.o$||'`;\
c++ -DHAVE_CONFIG_H -I.   -I/usr/include -std=c++11 -DDEFAULT_ALLOW_PROGRESSIVE -DHIGH_MEMORY   -pedantic -Wall -Wextra -Wno-write-strings -Wno-unused-parameter -fno-exceptions -fno-rtti -mssse3  -DNDEBUG -DGIT_REVISION=\"lepton-911d79a560c303a2a62e5412117d0a4ccb41836d\" -I./dependencies/xz/src/liblzma/api -I./src/vp8/util -I./src/vp8/model -I./src/vp8/decoder -I./src/vp8/encoder -I./dependencies -I./dependencies -I./dependencies/xz/src/liblzma/common -I./dependencies/xz/src/common -I./dependencies/xz/src/liblzma/lzma -I./dependencies/xz/src/liblzma/lz -I./dependencies/xz/src/liblzma/check -I./dependencies/xz/src/liblzma/rangecoder -I./dependencies/xz/src/liblzma/api -I./dependencies/xz/src/liblzma/simple -I./dependencies/xz/src/liblzma/delta -I./dependencies/xz/src/liblzma -O2 -fPIC -D_FORTIFY_SOURCE=2 -I/usr/include -MT src/io/MemReadWriter.o -MD -MP -MF $depbase.Tpo -c -o src/io/MemReadWriter.o src/io/MemReadWriter.cc &&\
mv -f $depbase.Tpo $depbase.Po
depbase=`echo src/lepton/bitops.o | sed 's|[^/]*$|.deps/&|;s|\.o$||'`;\
c++ -DHAVE_CONFIG_H -I.   -I/usr/include -std=c++11 -DDEFAULT_ALLOW_PROGRESSIVE -DHIGH_MEMORY   -pedantic -Wall -Wextra -Wno-write-strings -Wno-unused-parameter -fno-exceptions -fno-rtti -mssse3  -DNDEBUG -DGIT_REVISION=\"lepton-911d79a560c303a2a62e5412117d0a4ccb41836d\" -I./dependencies/xz/src/liblzma/api -I./src/vp8/util -I./src/vp8/model -I./src/vp8/decoder -I./src/vp8/encoder -I./dependencies -I./dependencies -I./dependencies/xz/src/liblzma/common -I./dependencies/xz/src/common -I./dependencies/xz/src/liblzma/lzma -I./dependencies/xz/src/liblzma/lz -I./dependencies/xz/src/liblzma/check -I./dependencies/xz/src/liblzma/rangecoder -I./dependencies/xz/src/liblzma/api -I./dependencies/xz/src/liblzma/simple -I./dependencies/xz/src/liblzma/delta -I./dependencies/xz/src/liblzma -O2 -fPIC -D_FORTIFY_SOURCE=2 -I/usr/include -MT src/lepton/bitops.o -MD -MP -MF $depbase.Tpo -c -o src/lepton/bitops.o src/lepton/bitops.cc &&\
mv -f $depbase.Tpo $depbase.Po
g++: error: unrecognized command line option '-mssse3'; did you mean '-mvis3'?
distcc[23566] ERROR: compile src/io/MemReadWriter.cc on 10.1.1.1:3642 failed
distcc[23566] (dcc_build_somewhere) Warning: remote compilation of 'src/io/MemReadWriter.cc' failed, retrying locally
distcc[23566] Warning: failed to distribute src/io/MemReadWriter.cc to 10.1.1.1:3642, running locally instead
depbase=`echo src/lepton/idct.o | sed 's|[^/]*$|.deps/&|;s|\.o$||'`;\
c++ -DHAVE_CONFIG_H -I.   -I/usr/include -std=c++11 -DDEFAULT_ALLOW_PROGRESSIVE -DHIGH_MEMORY   -pedantic -Wall -Wextra -Wno-write-strings -Wno-unused-parameter -fno-exceptions -fno-rtti -mssse3  -DNDEBUG -DGIT_REVISION=\"lepton-911d79a560c303a2a62e5412117d0a4ccb41836d\" -I./dependencies/xz/src/liblzma/api -I./src/vp8/util -I./src/vp8/model -I./src/vp8/decoder -I./src/vp8/encoder -I./dependencies -I./dependencies -I./dependencies/xz/src/liblzma/common -I./dependencies/xz/src/common -I./dependencies/xz/src/liblzma/lzma -I./dependencies/xz/src/liblzma/lz -I./dependencies/xz/src/liblzma/check -I./dependencies/xz/src/liblzma/rangecoder -I./dependencies/xz/src/liblzma/api -I./dependencies/xz/src/liblzma/simple -I./dependencies/xz/src/liblzma/delta -I./dependencies/xz/src/liblzma -O2 -fPIC -D_FORTIFY_SOURCE=2 -I/usr/include -MT src/lepton/idct.o -MD -MP -MF $depbase.Tpo -c -o src/lepton/idct.o src/lepton/idct.cc &&\
mv -f $depbase.Tpo $depbase.Po
g++: error: unrecognized command line option '-mssse3'; did you mean '-mvis3'?
g++: error: unrecognized command line option '-mssse3'; did you mean '-mvis3'?
distcc[23566] ERROR: compile src/io/MemReadWriter.cc on localhost failed
distcc[22209] ERROR: compile src/lepton/bitops.cc on 10.1.1.1:3642 failed
distcc[22209] (dcc_build_somewhere) Warning: remote compilation of 'src/lepton/bitops.cc' failed, retrying locally
distcc[22209] Warning: failed to distribute src/lepton/bitops.cc to 10.1.1.1:3642, running locally instead
g++: error: unrecognized command line option '-mssse3'; did you mean '-mvis3'?
distcc[15030] (dcc_build_somewhere) Warning: failed to distribute, running locally instead
distcc[22209] ERROR: compile src/lepton/bitops.cc on localhost failed
gmake[1]: *** [Makefile:1903: src/io/MemReadWriter.o] Error 1
gmake[1]: *** Waiting for unfinished jobs....
gmake[1]: *** [Makefile:1903: src/lepton/bitops.o] Error 1
g++: error: unrecognized command line option '-mssse3'; did you mean '-mvis3'?
distcc[15030] ERROR: compile src/lepton/idct.cc on localhost failed
gmake[1]: *** [Makefile:1903: src/lepton/idct.o] Error 1
gmake[1]: Leaving directory '/tmp/pkgbuild/graphics/lepton/work.sparc64/lepton-911d79a560c303a2a62e5412117d0a4ccb41836d'
gmake: *** [Makefile:1283: all] Error 2
*** Error code 2

Stop.
make[1]: stopped in /usr/pkgsrc/graphics/lepton
*** Error code 1

Stop.
make: stopped in /usr/pkgsrc/graphics/lepton