=> Bootstrap dependency digest>=20211023: found digest-20220214
===> Skipping vulnerability checks.
WARNING: No /usr/pkg/pkgdb/pkg-vulnerabilities file found.
WARNING: To fix run: `/usr/sbin/pkg_admin -K /usr/pkg/pkgdb fetch-pkg-vulnerabilities'.
===> Building for libime-1.0.4nb5
[  0%] Building CXX object src/libime/core/CMakeFiles/kenlm.dir/kenlm/lm/bhiksha.cc.o
[  0%] Built target opengram-dict-download
[  0%] Built target table-dict-download
[  1%] Building CXX object src/libime/core/CMakeFiles/kenlm.dir/kenlm/lm/binary_format.cc.o
[  2%] Generating .table-dict-extract.stamp
[  2%] Built target opengram-lm-download
[  2%] Built target table-dict-extract
[  3%] Generating .opengram-dict-extract.stamp
[  4%] Building CXX object src/libime/core/CMakeFiles/kenlm.dir/kenlm/lm/config.cc.o
[  5%] Generating .opengram-lm-extract.stamp
[  5%] Building CXX object src/libime/core/CMakeFiles/kenlm.dir/kenlm/lm/lm_exception.cc.o
[  6%] Built target opengram-dict-extract
[  7%] Building CXX object src/libime/core/CMakeFiles/kenlm.dir/kenlm/lm/quantize.cc.o
[  8%] Building CXX object src/libime/core/CMakeFiles/kenlm.dir/kenlm/lm/model.cc.o
[  9%] Building CXX object src/libime/core/CMakeFiles/kenlm.dir/kenlm/lm/read_arpa.cc.o
/tmp/pkgbuild/inputmethod/libime/work.sparc64/libime-1.0.4/src/libime/core/kenlm/lm/read_arpa.cc: In function 'void lm::ReadBackoff(util::FilePiece&, float&)':
/tmp/pkgbuild/inputmethod/libime/work.sparc64/libime-1.0.4/src/libime/core/kenlm/lm/read_arpa.cc:141:21: warning: this statement may fall through [-Wimplicit-fallthrough=]
/tmp/pkgbuild/inputmethod/libime/work.sparc64/libime-1.0.4/src/libime/core/kenlm/lm/read_arpa.cc:143:5: note: here
[  9%] Building CXX object src/libime/core/CMakeFiles/kenlm.dir/kenlm/lm/search_hashed.cc.o
In file included from /tmp/pkgbuild/inputmethod/libime/work.sparc64/libime-1.0.4/src/libime/core/kenlm/lm/model.hh:13:0,
                 from /tmp/pkgbuild/inputmethod/libime/work.sparc64/libime-1.0.4/src/libime/core/kenlm/lm/model.cc:1:
/tmp/pkgbuild/inputmethod/libime/work.sparc64/libime-1.0.4/src/libime/core/kenlm/lm/vocab.hh: In member function 'void lm::ngram::NoOpUniqueWords::operator()(const StringPiece&)':
/tmp/pkgbuild/inputmethod/libime/work.sparc64/libime-1.0.4/src/libime/core/kenlm/lm/vocab.hh:234:40: warning: unused parameter 'word' [-Wunused-parameter]
[ 10%] Building CXX object src/libime/core/CMakeFiles/kenlm.dir/kenlm/lm/search_trie.cc.o
In file included from /tmp/pkgbuild/inputmethod/libime/work.sparc64/libime-1.0.4/src/libime/core/kenlm/lm/model.hh:13:0,
                 from /tmp/pkgbuild/inputmethod/libime/work.sparc64/libime-1.0.4/src/libime/core/kenlm/lm/search_hashed.cc:6:
/tmp/pkgbuild/inputmethod/libime/work.sparc64/libime-1.0.4/src/libime/core/kenlm/lm/vocab.hh: In member function 'void lm::ngram::NoOpUniqueWords::operator()(const StringPiece&)':
/tmp/pkgbuild/inputmethod/libime/work.sparc64/libime-1.0.4/src/libime/core/kenlm/lm/vocab.hh:234:40: warning: unused parameter 'word' [-Wunused-parameter]
/tmp/pkgbuild/inputmethod/libime/work.sparc64/libime-1.0.4/src/libime/core/kenlm/lm/search_hashed.cc: In member function 'void lm::ngram::detail::HashedSearch<Value>::DispatchBuild(util::FilePiece&, const std::vector<long unsigned int>&, const lm::ngram::Config&, const lm::ngram::ProbingVocabulary&, lm::PositiveProbWarn&) [with Value = lm::ngram::BackoffValue]':
/tmp/pkgbuild/inputmethod/libime/work.sparc64/libime-1.0.4/src/libime/core/kenlm/lm/search_hashed.cc:244:131: warning: unused parameter 'config' [-Wunused-parameter]
In file included from /tmp/pkgbuild/inputmethod/libime/work.sparc64/libime-1.0.4/src/libime/core/kenlm/lm/search_hashed.cc:1:0:
/tmp/pkgbuild/inputmethod/libime/work.sparc64/libime-1.0.4/src/libime/core/kenlm/lm/search_hashed.hh: In instantiation of 'lm::ngram::detail::HashedSearch<Value>::Unigram::Unigram(void*, uint64_t) [with Value = lm::ngram::BackoffValue; uint64_t = long unsigned int]':
/tmp/pkgbuild/inputmethod/libime/work.sparc64/libime-1.0.4/src/libime/core/kenlm/lm/search_hashed.cc:293:16:   required from here
/tmp/pkgbuild/inputmethod/libime/work.sparc64/libime-1.0.4/src/libime/core/kenlm/lm/search_hashed.hh:149:39: warning: unused parameter 'count' [-Wunused-parameter]
/tmp/pkgbuild/inputmethod/libime/work.sparc64/libime-1.0.4/src/libime/core/kenlm/lm/search_hashed.hh: In instantiation of 'lm::ngram::detail::HashedSearch<Value>::Unigram::Unigram(void*, uint64_t) [with Value = lm::ngram::RestValue; uint64_t = long unsigned int]':
/tmp/pkgbuild/inputmethod/libime/work.sparc64/libime-1.0.4/src/libime/core/kenlm/lm/search_hashed.cc:294:16:   required from here
/tmp/pkgbuild/inputmethod/libime/work.sparc64/libime-1.0.4/src/libime/core/kenlm/lm/search_hashed.hh:149:39: warning: unused parameter 'count' [-Wunused-parameter]
[ 11%] Building CXX object src/libime/core/CMakeFiles/kenlm.dir/kenlm/lm/sizes.cc.o
In file included from /tmp/pkgbuild/inputmethod/libime/work.sparc64/libime-1.0.4/src/libime/core/kenlm/lm/model.hh:13:0,
                 from /tmp/pkgbuild/inputmethod/libime/work.sparc64/libime-1.0.4/src/libime/core/kenlm/lm/sizes.cc:2:
/tmp/pkgbuild/inputmethod/libime/work.sparc64/libime-1.0.4/src/libime/core/kenlm/lm/vocab.hh: In member function 'void lm::ngram::NoOpUniqueWords::operator()(const StringPiece&)':
/tmp/pkgbuild/inputmethod/libime/work.sparc64/libime-1.0.4/src/libime/core/kenlm/lm/vocab.hh:234:40: warning: unused parameter 'word' [-Wunused-parameter]
In file included from /tmp/pkgbuild/inputmethod/libime/work.sparc64/libime-1.0.4/src/libime/core/kenlm/lm/search_trie.cc:12:0:
/tmp/pkgbuild/inputmethod/libime/work.sparc64/libime-1.0.4/src/libime/core/kenlm/lm/vocab.hh: In member function 'void lm::ngram::NoOpUniqueWords::operator()(const StringPiece&)':
/tmp/pkgbuild/inputmethod/libime/work.sparc64/libime-1.0.4/src/libime/core/kenlm/lm/vocab.hh:234:40: warning: unused parameter 'word' [-Wunused-parameter]
[ 11%] Building CXX object src/libime/core/CMakeFiles/kenlm.dir/kenlm/lm/trie.cc.o
[ 12%] Building CXX object src/libime/core/CMakeFiles/kenlm.dir/kenlm/lm/trie_sort.cc.o
[ 13%] Building CXX object src/libime/core/CMakeFiles/kenlm.dir/kenlm/lm/value_build.cc.o
In file included from /tmp/pkgbuild/inputmethod/libime/work.sparc64/libime-1.0.4/src/libime/core/kenlm/lm/model.hh:13:0,
                 from /tmp/pkgbuild/inputmethod/libime/work.sparc64/libime-1.0.4/src/libime/core/kenlm/lm/value_build.cc:3:
/tmp/pkgbuild/inputmethod/libime/work.sparc64/libime-1.0.4/src/libime/core/kenlm/lm/vocab.hh: In member function 'void lm::ngram::NoOpUniqueWords::operator()(const StringPiece&)':
/tmp/pkgbuild/inputmethod/libime/work.sparc64/libime-1.0.4/src/libime/core/kenlm/lm/vocab.hh:234:40: warning: unused parameter 'word' [-Wunused-parameter]
In file included from /tmp/pkgbuild/inputmethod/libime/work.sparc64/libime-1.0.4/src/libime/core/kenlm/lm/trie_sort.cc:6:0:
/tmp/pkgbuild/inputmethod/libime/work.sparc64/libime-1.0.4/src/libime/core/kenlm/lm/vocab.hh: In member function 'void lm::ngram::NoOpUniqueWords::operator()(const StringPiece&)':
/tmp/pkgbuild/inputmethod/libime/work.sparc64/libime-1.0.4/src/libime/core/kenlm/lm/vocab.hh:234:40: warning: unused parameter 'word' [-Wunused-parameter]
/tmp/pkgbuild/inputmethod/libime/work.sparc64/libime-1.0.4/src/libime/core/kenlm/lm/trie_sort.cc: In member function 'void lm::ngram::trie::{anonymous}::ThrowCombine::operator()(std::size_t, unsigned char, const void*, const void*, FILE*) const':
/tmp/pkgbuild/inputmethod/libime/work.sparc64/libime-1.0.4/src/libime/core/kenlm/lm/trie_sort.cc:124:31: warning: unused parameter 'entry_size' [-Wunused-parameter]
/tmp/pkgbuild/inputmethod/libime/work.sparc64/libime-1.0.4/src/libime/core/kenlm/lm/trie_sort.cc:124:95: warning: unused parameter 'second' [-Wunused-parameter]
[ 13%] Building CXX object src/libime/core/CMakeFiles/kenlm.dir/kenlm/lm/vocab.cc.o
[ 14%] Building CXX object src/libime/core/CMakeFiles/kenlm.dir/kenlm/lm/virtual_interface.cc.o
[ 15%] Building CXX object src/libime/core/CMakeFiles/kenlm.dir/kenlm/util/bit_packing.cc.o
In file included from /tmp/pkgbuild/inputmethod/libime/work.sparc64/libime-1.0.4/src/libime/core/kenlm/lm/vocab.cc:1:0:
/tmp/pkgbuild/inputmethod/libime/work.sparc64/libime-1.0.4/src/libime/core/kenlm/lm/vocab.hh: In member function 'void lm::ngram::NoOpUniqueWords::operator()(const StringPiece&)':
/tmp/pkgbuild/inputmethod/libime/work.sparc64/libime-1.0.4/src/libime/core/kenlm/lm/vocab.hh:234:40: warning: unused parameter 'word' [-Wunused-parameter]
/tmp/pkgbuild/inputmethod/libime/work.sparc64/libime-1.0.4/src/libime/core/kenlm/lm/vocab.cc: In member function 'void lm::ngram::SortedVocabulary::SetupMemory(void*, std::size_t, std::size_t, const lm::ngram::Config&)':
/tmp/pkgbuild/inputmethod/libime/work.sparc64/libime-1.0.4/src/libime/core/kenlm/lm/vocab.cc:88:61: warning: unused parameter 'allocated' [-Wunused-parameter]
/tmp/pkgbuild/inputmethod/libime/work.sparc64/libime-1.0.4/src/libime/core/kenlm/lm/vocab.cc:88:84: warning: unused parameter 'entries' [-Wunused-parameter]
/tmp/pkgbuild/inputmethod/libime/work.sparc64/libime-1.0.4/src/libime/core/kenlm/lm/vocab.cc:88:107: warning: unused parameter 'config' [-Wunused-parameter]
[ 15%] Building CXX object src/libime/core/CMakeFiles/kenlm.dir/kenlm/util/double-conversion/bignum.cc.o
[ 16%] Building CXX object src/libime/core/CMakeFiles/kenlm.dir/kenlm/util/double-conversion/bignum-dtoa.cc.o
[ 17%] Building CXX object src/libime/core/CMakeFiles/kenlm.dir/kenlm/util/double-conversion/cached-powers.cc.o
[ 18%] Building CXX object src/libime/core/CMakeFiles/kenlm.dir/kenlm/util/double-conversion/diy-fp.cc.o
[ 19%] Building CXX object src/libime/core/CMakeFiles/kenlm.dir/kenlm/util/double-conversion/double-conversion.cc.o
[ 19%] Building CXX object src/libime/core/CMakeFiles/kenlm.dir/kenlm/util/double-conversion/fast-dtoa.cc.o
[ 20%] Building CXX object src/libime/core/CMakeFiles/kenlm.dir/kenlm/util/double-conversion/fixed-dtoa.cc.o
[ 20%] Building CXX object src/libime/core/CMakeFiles/kenlm.dir/kenlm/util/ersatz_progress.cc.o
[ 21%] Building CXX object src/libime/core/CMakeFiles/kenlm.dir/kenlm/util/double-conversion/strtod.cc.o
[ 22%] Building CXX object src/libime/core/CMakeFiles/kenlm.dir/kenlm/util/exception.cc.o
[ 23%] Building CXX object src/libime/core/CMakeFiles/kenlm.dir/kenlm/util/file.cc.o
[ 24%] Building CXX object src/libime/core/CMakeFiles/kenlm.dir/kenlm/util/file_piece.cc.o
/tmp/pkgbuild/inputmethod/libime/work.sparc64/libime-1.0.4/src/libime/core/kenlm/util/file.cc: In function 'void util::HolePunch(int, uint64_t, uint64_t)':
/tmp/pkgbuild/inputmethod/libime/work.sparc64/libime-1.0.4/src/libime/core/kenlm/util/file.cc:136:20: warning: unused parameter 'fd' [-Wunused-parameter]
/tmp/pkgbuild/inputmethod/libime/work.sparc64/libime-1.0.4/src/libime/core/kenlm/util/file.cc:136:33: warning: unused parameter 'offset' [-Wunused-parameter]
/tmp/pkgbuild/inputmethod/libime/work.sparc64/libime-1.0.4/src/libime/core/kenlm/util/file.cc:136:50: warning: unused parameter 'size' [-Wunused-parameter]
[ 24%] Building CXX object src/libime/core/CMakeFiles/kenlm.dir/kenlm/util/float_to_string.cc.o
[ 25%] Building CXX object src/libime/core/CMakeFiles/kenlm.dir/kenlm/util/integer_to_string.cc.o
[ 26%] Building CXX object src/libime/core/CMakeFiles/kenlm.dir/kenlm/util/mmap.cc.o
[ 26%] Building CXX object src/libime/core/CMakeFiles/kenlm.dir/kenlm/util/murmur_hash.cc.o
/tmp/pkgbuild/inputmethod/libime/work.sparc64/libime-1.0.4/src/libime/core/kenlm/util/mmap.cc: In function 'void* util::MapOrThrow(std::size_t, bool, int, bool, int, uint64_t)':
/tmp/pkgbuild/inputmethod/libime/work.sparc64/libime-1.0.4/src/libime/core/kenlm/util/mmap.cc:105:68: warning: unused parameter 'prefault' [-Wunused-parameter]
/tmp/pkgbuild/inputmethod/libime/work.sparc64/libime-1.0.4/src/libime/core/kenlm/util/mmap.cc: At global scope:
/tmp/pkgbuild/inputmethod/libime/work.sparc64/libime-1.0.4/src/libime/core/kenlm/util/mmap.cc:233:6: warning: 'void util::{anonymous}::ReplaceAndCopy(std::size_t, bool, util::scoped_memory&)' defined but not used [-Wunused-function]
[ 27%] Building CXX object src/libime/core/CMakeFiles/kenlm.dir/kenlm/util/parallel_read.cc.o
/tmp/pkgbuild/inputmethod/libime/work.sparc64/libime-1.0.4/src/libime/core/kenlm/util/murmur_hash.cc: In function 'uint64_t util::MurmurHash64A(const void*, std::size_t, uint64_t)':
/tmp/pkgbuild/inputmethod/libime/work.sparc64/libime-1.0.4/src/libime/core/kenlm/util/murmur_hash.cc:64:13: warning: this statement may fall through [-Wimplicit-fallthrough=]
/tmp/pkgbuild/inputmethod/libime/work.sparc64/libime-1.0.4/src/libime/core/kenlm/util/murmur_hash.cc:65:3: note: here
/tmp/pkgbuild/inputmethod/libime/work.sparc64/libime-1.0.4/src/libime/core/kenlm/util/murmur_hash.cc:65:13: warning: this statement may fall through [-Wimplicit-fallthrough=]
/tmp/pkgbuild/inputmethod/libime/work.sparc64/libime-1.0.4/src/libime/core/kenlm/util/murmur_hash.cc:66:3: note: here
/tmp/pkgbuild/inputmethod/libime/work.sparc64/libime-1.0.4/src/libime/core/kenlm/util/murmur_hash.cc:66:13: warning: this statement may fall through [-Wimplicit-fallthrough=]
/tmp/pkgbuild/inputmethod/libime/work.sparc64/libime-1.0.4/src/libime/core/kenlm/util/murmur_hash.cc:67:3: note: here
/tmp/pkgbuild/inputmethod/libime/work.sparc64/libime-1.0.4/src/libime/core/kenlm/util/murmur_hash.cc:67:13: warning: this statement may fall through [-Wimplicit-fallthrough=]
/tmp/pkgbuild/inputmethod/libime/work.sparc64/libime-1.0.4/src/libime/core/kenlm/util/murmur_hash.cc:68:3: note: here
/tmp/pkgbuild/inputmethod/libime/work.sparc64/libime-1.0.4/src/libime/core/kenlm/util/murmur_hash.cc:68:13: warning: this statement may fall through [-Wimplicit-fallthrough=]
/tmp/pkgbuild/inputmethod/libime/work.sparc64/libime-1.0.4/src/libime/core/kenlm/util/murmur_hash.cc:69:3: note: here
/tmp/pkgbuild/inputmethod/libime/work.sparc64/libime-1.0.4/src/libime/core/kenlm/util/murmur_hash.cc:69:13: warning: this statement may fall through [-Wimplicit-fallthrough=]
/tmp/pkgbuild/inputmethod/libime/work.sparc64/libime-1.0.4/src/libime/core/kenlm/util/murmur_hash.cc:70:3: note: here
/tmp/pkgbuild/inputmethod/libime/work.sparc64/libime-1.0.4/src/libime/core/kenlm/util/murmur_hash.cc: In function 'uint64_t util::MurmurHash64B(const void*, std::size_t, uint64_t)':
/tmp/pkgbuild/inputmethod/libime/work.sparc64/libime-1.0.4/src/libime/core/kenlm/util/murmur_hash.cc:136:14: warning: this statement may fall through [-Wimplicit-fallthrough=]
/tmp/pkgbuild/inputmethod/libime/work.sparc64/libime-1.0.4/src/libime/core/kenlm/util/murmur_hash.cc:137:3: note: here
/tmp/pkgbuild/inputmethod/libime/work.sparc64/libime-1.0.4/src/libime/core/kenlm/util/murmur_hash.cc:137:14: warning: this statement may fall through [-Wimplicit-fallthrough=]
/tmp/pkgbuild/inputmethod/libime/work.sparc64/libime-1.0.4/src/libime/core/kenlm/util/murmur_hash.cc:138:3: note: here
[ 28%] Building CXX object src/libime/core/CMakeFiles/kenlm.dir/kenlm/util/pool.cc.o
[ 29%] Building CXX object src/libime/core/CMakeFiles/kenlm.dir/kenlm/util/read_compressed.cc.o
[ 29%] Building CXX object src/libime/core/CMakeFiles/kenlm.dir/kenlm/util/scoped.cc.o
[ 30%] Building CXX object src/libime/core/CMakeFiles/kenlm.dir/kenlm/util/spaces.cc.o
/tmp/pkgbuild/inputmethod/libime/work.sparc64/libime-1.0.4/src/libime/core/kenlm/util/scoped.cc: In function 'void util::AdviseHugePages(const void*, std::size_t)':
/tmp/pkgbuild/inputmethod/libime/work.sparc64/libime-1.0.4/src/libime/core/kenlm/util/scoped.cc:37:34: warning: unused parameter 'addr' [-Wunused-parameter]
/tmp/pkgbuild/inputmethod/libime/work.sparc64/libime-1.0.4/src/libime/core/kenlm/util/scoped.cc:37:52: warning: unused parameter 'size' [-Wunused-parameter]
[ 31%] Building CXX object src/libime/core/CMakeFiles/kenlm.dir/kenlm/util/string_piece.cc.o
[ 31%] Building CXX object src/libime/core/CMakeFiles/kenlm.dir/kenlm/util/usage.cc.o
[ 32%] Linking CXX static library libkenlm.a
[ 32%] Built target kenlm
[ 33%] Building CXX object tools/CMakeFiles/libime_slm_build_binary.dir/__/src/libime/core/kenlm/lm/build_binary_main.cc.o
[ 33%] Building CXX object src/libime/core/CMakeFiles/IMECore.dir/datrie.cpp.o
In file included from /tmp/pkgbuild/inputmethod/libime/work.sparc64/libime-1.0.4/src/libime/core/kenlm/lm/model.hh:13:0,
                 from /tmp/pkgbuild/inputmethod/libime/work.sparc64/libime-1.0.4/src/libime/core/kenlm/lm/build_binary_main.cc:1:
/tmp/pkgbuild/inputmethod/libime/work.sparc64/libime-1.0.4/src/libime/core/kenlm/lm/vocab.hh: In member function 'void lm::ngram::NoOpUniqueWords::operator()(const StringPiece&)':
/tmp/pkgbuild/inputmethod/libime/work.sparc64/libime-1.0.4/src/libime/core/kenlm/lm/vocab.hh:234:40: warning: unused parameter 'word' [-Wunused-parameter]
[ 34%] Linking CXX executable libime_slm_build_binary
[ 34%] Built target libime_slm_build_binary
[ 35%] Building CXX object src/libime/core/CMakeFiles/IMECore.dir/languagemodel.cpp.o
[ 36%] Building CXX object src/libime/core/CMakeFiles/IMECore.dir/decoder.cpp.o
In file included from /tmp/pkgbuild/inputmethod/libime/work.sparc64/libime-1.0.4/src/libime/core/kenlm/lm/model.hh:13:0,
                 from /tmp/pkgbuild/inputmethod/libime/work.sparc64/libime-1.0.4/src/libime/core/languagemodel.cpp:11:
/tmp/pkgbuild/inputmethod/libime/work.sparc64/libime-1.0.4/src/libime/core/kenlm/lm/vocab.hh: In member function 'void lm::ngram::NoOpUniqueWords::operator()(const StringPiece&)':
/tmp/pkgbuild/inputmethod/libime/work.sparc64/libime-1.0.4/src/libime/core/kenlm/lm/vocab.hh:234:40: warning: unused parameter 'word' [-Wunused-parameter]
[ 36%] Building CXX object src/libime/core/CMakeFiles/IMECore.dir/inputbuffer.cpp.o
[ 37%] Building CXX object src/libime/core/CMakeFiles/IMECore.dir/lattice.cpp.o
[ 38%] Building CXX object src/libime/core/CMakeFiles/IMECore.dir/userlanguagemodel.cpp.o
[ 38%] Built target opengram-lm-extract
[ 39%] Building CXX object src/libime/core/CMakeFiles/IMECore.dir/historybigram.cpp.o
[ 40%] Generating kenlm_sc.arpa
In file included from /tmp/pkgbuild/inputmethod/libime/work.sparc64/libime-1.0.4/src/libime/core/kenlm/lm/model.hh:13:0,
                 from /tmp/pkgbuild/inputmethod/libime/work.sparc64/libime-1.0.4/src/libime/core/userlanguagemodel.cpp:10:
/tmp/pkgbuild/inputmethod/libime/work.sparc64/libime-1.0.4/src/libime/core/kenlm/lm/vocab.hh: In member function 'void lm::ngram::NoOpUniqueWords::operator()(const StringPiece&)':
/tmp/pkgbuild/inputmethod/libime/work.sparc64/libime-1.0.4/src/libime/core/kenlm/lm/vocab.hh:234:40: warning: unused parameter 'word' [-Wunused-parameter]
[ 40%] Building CXX object src/libime/core/CMakeFiles/IMECore.dir/segmentgraph.cpp.o
[ 41%] Building CXX object src/libime/core/CMakeFiles/IMECore.dir/utils.cpp.o
[ 42%] Building CXX object src/libime/core/CMakeFiles/IMECore.dir/prediction.cpp.o
[ 42%] Building CXX object src/libime/core/CMakeFiles/IMECore.dir/triedictionary.cpp.o
[ 43%] Linking CXX shared library libIMECore.so
[ 43%] Built target IMECore
[ 44%] Building CXX object test/CMakeFiles/triebench.dir/triebench.cpp.o
[ 45%] Building CXX object test/CMakeFiles/testmodel.dir/testmodel.cpp.o
[ 46%] Linking CXX executable triebench
[ 46%] Built target triebench
[ 47%] Building CXX object src/libime/pinyin/CMakeFiles/IMEPinyin.dir/pinyincontext.cpp.o
[ 47%] Linking CXX executable testmodel
[ 47%] Built target testmodel
[ 47%] Building CXX object src/libime/table/CMakeFiles/IMETable.dir/tablebaseddictionary.cpp.o
[ 48%] Building CXX object src/libime/pinyin/CMakeFiles/IMEPinyin.dir/pinyindata.cpp.o
[ 48%] Building CXX object src/libime/pinyin/CMakeFiles/IMEPinyin.dir/pinyindecoder.cpp.o
/tmp/pkgbuild/inputmethod/libime/work.sparc64/libime-1.0.4/src/libime/table/tablebaseddictionary.cpp: In member function 'void libime::TableBasedDictionary::loadUser(std::istream&, libime::TableFormat)':
/tmp/pkgbuild/inputmethod/libime/work.sparc64/libime-1.0.4/src/libime/table/tablebaseddictionary.cpp:827:44: warning: unused variable 'flag' [-Wunused-variable]
[ 49%] Building CXX object src/libime/table/CMakeFiles/IMETable.dir/tablecontext.cpp.o
[ 50%] Building CXX object src/libime/pinyin/CMakeFiles/IMEPinyin.dir/pinyindictionary.cpp.o
[ 51%] Building CXX object src/libime/table/CMakeFiles/IMETable.dir/tableoptions.cpp.o
[ 51%] Building CXX object src/libime/table/CMakeFiles/IMETable.dir/tabledecoder.cpp.o
[ 52%] Building CXX object src/libime/pinyin/CMakeFiles/IMEPinyin.dir/pinyinencoder.cpp.o
[ 53%] Building CXX object src/libime/table/CMakeFiles/IMETable.dir/autophrasedict.cpp.o
[ 54%] Building CXX object src/libime/table/CMakeFiles/IMETable.dir/log.cpp.o
/tmp/pkgbuild/inputmethod/libime/work.sparc64/libime-1.0.4/src/libime/pinyin/pinyinencoder.cpp: In static member function 'static std::__cxx11::string libime::PinyinEncoder::initialFinalToPinyinString(libime::PinyinInitial, libime::PinyinFinal)':
/tmp/pkgbuild/inputmethod/libime/work.sparc64/libime-1.0.4/src/libime/pinyin/pinyinencoder.cpp:441:9: warning: this statement may fall through [-Wimplicit-fallthrough=]
/tmp/pkgbuild/inputmethod/libime/work.sparc64/libime-1.0.4/src/libime/pinyin/pinyinencoder.cpp:450:5: note: here
[ 54%] Building CXX object src/libime/pinyin/CMakeFiles/IMEPinyin.dir/pinyinime.cpp.o
[ 55%] Linking CXX shared library libIMETable.so
[ 55%] Built target IMETable
[ 56%] Building CXX object tools/CMakeFiles/libime_prediction.dir/libime_prediction.cpp.o
[ 57%] Building CXX object src/libime/pinyin/CMakeFiles/IMEPinyin.dir/pinyinmatchstate.cpp.o
[ 57%] Linking CXX executable libime_prediction
[ 57%] Built target libime_prediction
[ 58%] Building CXX object tools/CMakeFiles/libime_history.dir/libime_history.cpp.o
[ 59%] Building CXX object src/libime/pinyin/CMakeFiles/IMEPinyin.dir/shuangpinprofile.cpp.o
[ 60%] Linking CXX executable libime_history
[ 60%] Built target libime_history
[ 61%] Building CXX object test/CMakeFiles/testtableime.dir/testtableime.cpp.o
[ 61%] Linking CXX executable testtableime
[ 62%] Linking CXX shared library libIMEPinyin.so
[ 62%] Built target testtableime
[ 62%] Building CXX object tools/CMakeFiles/libime_tabledict.dir/libime_tabledict.cpp.o
[ 62%] Built target IMEPinyin
[ 63%] Building CXX object tools/CMakeFiles/libime_migrate_fcitx4_table.dir/libime_migrate_fcitx4_table.cpp.o
[ 64%] Linking CXX executable libime_tabledict
[ 64%] Built target libime_tabledict
[ 65%] Building CXX object test/CMakeFiles/testtable.dir/testtable.cpp.o
[ 65%] Linking CXX executable libime_migrate_fcitx4_table
[ 65%] Built target libime_migrate_fcitx4_table
[ 66%] Building CXX object test/CMakeFiles/testpinyindata.dir/testpinyindata.cpp.o
[ 67%] Linking CXX executable testtable
[ 67%] Built target testtable
[ 67%] Building CXX object test/CMakeFiles/testpinyinencoder.dir/testpinyinencoder.cpp.o
[ 67%] Linking CXX executable testpinyindata
[ 68%] Linking CXX executable testpinyinencoder
[ 68%] Built target testpinyindata
[ 68%] Building CXX object test/CMakeFiles/testinputbuffer.dir/testinputbuffer.cpp.o
[ 68%] Built target testpinyinencoder
[ 69%] Building CXX object test/CMakeFiles/testhistorybigram.dir/testhistorybigram.cpp.o
[ 70%] Linking CXX executable testinputbuffer
[ 70%] Built target testinputbuffer
[ 71%] Building CXX object test/CMakeFiles/testshuangpinprofile.dir/testshuangpinprofile.cpp.o
[ 72%] Linking CXX executable testhistorybigram
[ 72%] Built target testhistorybigram
[ 72%] Building CXX object test/CMakeFiles/testtrie.dir/testtrie.cpp.o
[ 73%] Linking CXX executable testtrie
[ 73%] Built target testtrie
[ 74%] Building CXX object test/CMakeFiles/testautophrasedict.dir/testautophrasedict.cpp.o
[ 75%] Linking CXX executable testautophrasedict
[ 75%] Built target testautophrasedict
[ 76%] Building CXX object test/CMakeFiles/testpinyincontext.dir/testpinyincontext.cpp.o
[ 76%] Linking CXX executable testshuangpinprofile
[ 76%] Built target testshuangpinprofile
[ 77%] Building CXX object test/CMakeFiles/testpinyindictionary.dir/testpinyindictionary.cpp.o
[ 78%] Linking CXX executable testpinyincontext
[ 78%] Built target testpinyincontext
[ 78%] Building CXX object test/CMakeFiles/testprediction.dir/testprediction.cpp.o
[ 79%] Linking CXX executable testpinyindictionary
[ 79%] Built target testpinyindictionary
[ 80%] Building CXX object test/CMakeFiles/testtableime_unit.dir/testtableime_unit.cpp.o
[ 81%] Linking CXX executable testtableime_unit
[ 81%] Built target testtableime_unit
[ 82%] Building CXX object test/CMakeFiles/testpinyinime.dir/testpinyinime.cpp.o
[ 83%] Linking CXX executable testprediction
[ 83%] Built target testprediction
[ 84%] Building CXX object tools/CMakeFiles/libime_pinyindict.dir/libime_pinyindict.cpp.o
[ 85%] Linking CXX executable libime_pinyindict
[ 85%] Built target libime_pinyindict
[ 85%] Building CXX object tools/CMakeFiles/libime_migrate_fcitx4_pinyin.dir/libime_migrate_fcitx4_pinyin.cpp.o
[ 86%] Linking CXX executable testpinyinime
[ 86%] Built target testpinyinime
[ 87%] Generating db.main.dict
[ 88%] Generating erbi.main.dict
[ 88%] Generating qxm.main.dict
[ 89%] Generating wanfeng.main.dict
[ 90%] Generating wbpy.main.dict
[ 91%] Linking CXX executable libime_migrate_fcitx4_pinyin
[ 91%] Built target libime_migrate_fcitx4_pinyin
[ 92%] Generating dict.converted
[ 93%] Generating sc.dict
[ 93%] Generating wbx.main.dict
[ 93%] Built target opengram-dict
[ 94%] Generating zrm.main.dict
[ 95%] Generating cj.main.dict
[ 96%] Built target table-dict
[ 96%] Generating sc.lm
Reading /tmp/pkgbuild/inputmethod/libime/work.sparc64/libime-1.0.4/data/kenlm_sc.arpa
----5---10---15---20---25---30---35---40---45---50---55---60---65---70---75---80---85---90---95--100
*[1]   Bus error (core dumped) ../tools/libime_slm_build_binary -s -a 22 -q 8...
--- data/sc.lm ---
*** [data/sc.lm] Error code 138
make[2]: *** data/sc.lm removed

make[2]: stopped in /tmp/pkgbuild/inputmethod/libime/work.sparc64/libime-1.0.4
1 error

make[2]: stopped in /tmp/pkgbuild/inputmethod/libime/work.sparc64/libime-1.0.4
--- data/CMakeFiles/opengram-lm.dir/all ---
*** [data/CMakeFiles/opengram-lm.dir/all] Error code 2

make[1]: stopped in /tmp/pkgbuild/inputmethod/libime/work.sparc64/libime-1.0.4
1 error

make[1]: stopped in /tmp/pkgbuild/inputmethod/libime/work.sparc64/libime-1.0.4
*** [all] Error code 2

make: stopped in /tmp/pkgbuild/inputmethod/libime/work.sparc64/libime-1.0.4
1 error

make: stopped in /tmp/pkgbuild/inputmethod/libime/work.sparc64/libime-1.0.4
*** Error code 2

Stop.
make[1]: stopped in /usr/pkgsrc/inputmethod/libime
*** Error code 1

Stop.
make: stopped in /usr/pkgsrc/inputmethod/libime