=> Bootstrap dependency digest>=20211023: found digest-20220214
===> Skipping vulnerability checks.
WARNING: No /usr/pkg/pkgdb/pkg-vulnerabilities file found.
WARNING: To fix run: `/usr/sbin/pkg_admin -K /usr/pkg/pkgdb fetch-pkg-vulnerabilities'.
===> Building for mono-6.12.0.122nb8
/usr/pkg/bin/gmake  all-recursive
gmake[1]: Entering directory '/tmp/pkgbuild/lang/mono/work.sparc64/mono-6.12.0.122'
Making all in po
gmake[2]: Entering directory '/tmp/pkgbuild/lang/mono/work.sparc64/mono-6.12.0.122/po'
Making all in mcs
gmake[3]: Entering directory '/tmp/pkgbuild/lang/mono/work.sparc64/mono-6.12.0.122/po/mcs'
gmake[3]: Leaving directory '/tmp/pkgbuild/lang/mono/work.sparc64/mono-6.12.0.122/po/mcs'
gmake[3]: Entering directory '/tmp/pkgbuild/lang/mono/work.sparc64/mono-6.12.0.122/po'
gmake[3]: Nothing to be done for 'all-am'.
gmake[3]: Leaving directory '/tmp/pkgbuild/lang/mono/work.sparc64/mono-6.12.0.122/po'
gmake[2]: Leaving directory '/tmp/pkgbuild/lang/mono/work.sparc64/mono-6.12.0.122/po'
Making all in external/bdwgc
gmake[2]: Entering directory '/tmp/pkgbuild/lang/mono/work.sparc64/mono-6.12.0.122/external/bdwgc'
gmake[3]: Entering directory '/tmp/pkgbuild/lang/mono/work.sparc64/mono-6.12.0.122/external/bdwgc'
depbase=`echo extra/gc.lo | sed 's|[^/]*$|.deps/&|;s|\.lo$||'`;\
/bin/sh ./libtool  --tag=CC   --mode=compile gcc -DHAVE_CONFIG_H   -I./include -I./include   -I/usr/include -I/usr/pkg/include/python3.10 -I/usr/pkg/include   -fexceptions -Wall -Wextra -Wpedantic -Wno-long-long -O2 -fPIC -D_FORTIFY_SOURCE=2 -I/usr/include -I/usr/pkg/include/python3.10 -I/usr/pkg/include -fno-strict-aliasing  -MT extra/gc.lo -MD -MP -MF $depbase.Tpo -c -o extra/gc.lo extra/gc.c &&\
mv -f $depbase.Tpo $depbase.Plo
libtool: compile:  gcc -DHAVE_CONFIG_H -I./include -I/tmp/pkgbuild/lang/mono/work.sparc64/.buildlink/include/python3.10 -I/tmp/pkgbuild/lang/mono/work.sparc64/.buildlink/include -fexceptions -Wall -Wextra -Wpedantic -Wno-long-long -O2 -fPIC -D_FORTIFY_SOURCE=2 -fno-strict-aliasing -MT extra/gc.lo -MD -MP -MF extra/.deps/gc.Tpo -c extra/gc.c  -fPIC -DPIC -o extra/.libs/gc.o
In file included from ./include/private/gc_priv.h:254:0,
                 from ./include/private/dbg_mlc.h:28,
                 from extra/../backgraph.c:15,
                 from extra/gc.c:39:
./include/private/gc_atomic_ops.h:105:11: fatal error: atomic_ops.h: No such file or directory
 # include "atomic_ops.h"
           ^~~~~~~~~~~~~~
compilation terminated.
distcc[27433] ERROR: compile extra/gc.c on 10.1.1.1:3642 failed
distcc[27433] (dcc_build_somewhere) Warning: remote compilation of 'extra/gc.c' failed, retrying locally
distcc[27433] Warning: failed to distribute extra/gc.c to 10.1.1.1:3642, running locally instead
In file included from ./include/private/gc_priv.h:254:0,
                 from ./include/private/dbg_mlc.h:28,
                 from extra/../backgraph.c:15,
                 from extra/gc.c:39:
./include/private/gc_atomic_ops.h:105:11: fatal error: atomic_ops.h: No such file or directory
 # include "atomic_ops.h"
           ^~~~~~~~~~~~~~
compilation terminated.
distcc[27433] ERROR: compile extra/gc.c on localhost failed
gmake[3]: *** [Makefile:1646: extra/gc.lo] Error 1
gmake[3]: Leaving directory '/tmp/pkgbuild/lang/mono/work.sparc64/mono-6.12.0.122/external/bdwgc'
gmake[2]: *** [Makefile:1870: all-recursive] Error 1
gmake[2]: Leaving directory '/tmp/pkgbuild/lang/mono/work.sparc64/mono-6.12.0.122/external/bdwgc'
gmake[1]: *** [Makefile:602: all-recursive] Error 1
gmake[1]: Leaving directory '/tmp/pkgbuild/lang/mono/work.sparc64/mono-6.12.0.122'
gmake: *** [Makefile:530: all] Error 2
*** Error code 2

Stop.
make[1]: stopped in /usr/pkgsrc/lang/mono
*** Error code 1

Stop.
make: stopped in /usr/pkgsrc/lang/mono