=> Bootstrap dependency digest>=20211023: found digest-20220214
===> Skipping vulnerability checks.
WARNING: No /usr/pkg/pkgdb/pkg-vulnerabilities file found.
WARNING: To fix run: `/usr/sbin/pkg_admin -K /usr/pkg/pkgdb fetch-pkg-vulnerabilities'.
===> Building for mysql-server-5.7.40
[  0%] Building C object extra/zlib/zlib-1.2.12/CMakeFiles/zlib.dir/adler32.c.o
[  0%] Built target INFO_SRC
[  0%] Built target INFO_BIN
[  0%] Building C object extra/zlib/zlib-1.2.12/CMakeFiles/zlib.dir/compress.c.o
[  0%] Building C object strings/CMakeFiles/strings.dir/bchange.c.o
[  0%] Building C object vio/CMakeFiles/vio.dir/vio.c.o
[  0%] Building C object strings/CMakeFiles/strings.dir/ctype-big5.c.o
[  0%] Building C object extra/zlib/zlib-1.2.12/CMakeFiles/zlib.dir/crc32.c.o
[  0%] Building C object vio/CMakeFiles/vio.dir/viosocket.c.o
[  0%] Building C object strings/CMakeFiles/strings.dir/ctype-bin.c.o
[  0%] Building C object strings/CMakeFiles/strings.dir/ctype-cp932.c.o
[  0%] Building C object extra/zlib/zlib-1.2.12/CMakeFiles/zlib.dir/deflate.c.o
[  0%] Building C object vio/CMakeFiles/vio.dir/viossl.c.o
[  0%] Building C object extra/zlib/zlib-1.2.12/CMakeFiles/zlib.dir/gzclose.c.o
[  1%] Building C object vio/CMakeFiles/vio.dir/viosslfactories.c.o
[  1%] Building C object strings/CMakeFiles/strings.dir/ctype-czech.c.o
[  1%] Building C object strings/CMakeFiles/strings.dir/ctype-euc_kr.c.o
[  1%] Building C object extra/zlib/zlib-1.2.12/CMakeFiles/zlib.dir/gzlib.c.o
[  1%] Linking C static library ../archive_output_directory/libvio.a
[  1%] Building C object extra/zlib/zlib-1.2.12/CMakeFiles/zlib.dir/gzread.c.o
[  2%] Building C object strings/CMakeFiles/strings.dir/ctype-eucjpms.c.o
[  2%] Building C object extra/zlib/zlib-1.2.12/CMakeFiles/zlib.dir/gzwrite.c.o
[  2%] Built target vio
[  2%] Building C object strings/CMakeFiles/strings.dir/ctype-extra.c.o
[  2%] Building C object extra/zlib/zlib-1.2.12/CMakeFiles/zlib.dir/inflate.c.o
[  2%] Building C object extra/zlib/zlib-1.2.12/CMakeFiles/zlib.dir/infback.c.o
[  2%] Building C object regex/CMakeFiles/regex.dir/regcomp.c.o
[  2%] Building C object extra/zlib/zlib-1.2.12/CMakeFiles/zlib.dir/inftrees.c.o
[  2%] Building C object strings/CMakeFiles/strings.dir/ctype-gb2312.c.o
[  2%] Building C object extra/zlib/zlib-1.2.12/CMakeFiles/zlib.dir/inffast.c.o
/tmp/pkgbuild/databases/mysql57-server/work.sparc64/mysql-5.7.40/regex/regcomp.c: In function 'p_ere_exp':
/tmp/pkgbuild/databases/mysql57-server/work.sparc64/mysql-5.7.40/regex/regcomp.c:355:86: warning: this statement may fall through [-Wimplicit-fallthrough=]
/tmp/pkgbuild/databases/mysql57-server/work.sparc64/mysql-5.7.40/regex/regcomp.c:357:2: note: here
/tmp/pkgbuild/databases/mysql57-server/work.sparc64/mysql-5.7.40/regex/regcomp.c: In function 'p_simp_re':
/tmp/pkgbuild/databases/mysql57-server/work.sparc64/mysql-5.7.40/regex/regcomp.c:562:22: warning: this statement may fall through [-Wimplicit-fallthrough=]
/tmp/pkgbuild/databases/mysql57-server/work.sparc64/mysql-5.7.40/regex/regcomp.c:564:2: note: here
/tmp/pkgbuild/databases/mysql57-server/work.sparc64/mysql-5.7.40/regex/regcomp.c: In function 'findmust':
/tmp/pkgbuild/databases/mysql57-server/work.sparc64/mysql-5.7.40/regex/regcomp.c:1581:4: warning: this statement may fall through [-Wimplicit-fallthrough=]
/tmp/pkgbuild/databases/mysql57-server/work.sparc64/mysql-5.7.40/regex/regcomp.c:1583:3: note: here
[  2%] Building C object regex/CMakeFiles/regex.dir/regerror.c.o
[  2%] Building C object extra/zlib/zlib-1.2.12/CMakeFiles/zlib.dir/trees.c.o
[  2%] Building C object strings/CMakeFiles/strings.dir/ctype-gbk.c.o
[  2%] Building C object regex/CMakeFiles/regex.dir/regexec.c.o
[  2%] Building C object extra/zlib/zlib-1.2.12/CMakeFiles/zlib.dir/uncompr.c.o
[  2%] Building C object strings/CMakeFiles/strings.dir/ctype-gb18030.c.o
[  2%] Building C object regex/CMakeFiles/regex.dir/regfree.c.o
[  2%] Building C object extra/zlib/zlib-1.2.12/CMakeFiles/zlib.dir/zutil.c.o
[  2%] Building C object regex/CMakeFiles/regex.dir/reginit.c.o
[  2%] Linking C static library ../../../archive_output_directory/libzlib.a
[  2%] Linking C static library ../archive_output_directory/libregex.a
[  2%] Building C object strings/CMakeFiles/strings.dir/ctype-latin1.c.o
[  2%] Building C object strings/CMakeFiles/strings.dir/ctype-mb.c.o
[  2%] Built target regex
[  2%] Built target zlib
[  2%] Building C object strings/CMakeFiles/strings.dir/ctype-simple.c.o
[  2%] Building C object strings/CMakeFiles/strings.dir/ctype-sjis.c.o
/tmp/pkgbuild/databases/mysql57-server/work.sparc64/mysql-5.7.40/strings/ctype-mb.c: In function 'my_strnxfrm_mb':
/tmp/pkgbuild/databases/mysql57-server/work.sparc64/mysql-5.7.40/strings/ctype-mb.c:637:98: warning: this statement may fall through [-Wimplicit-fallthrough=]
/tmp/pkgbuild/databases/mysql57-server/work.sparc64/mysql-5.7.40/strings/ctype-mb.c:637:108: note: here
/tmp/pkgbuild/databases/mysql57-server/work.sparc64/mysql-5.7.40/strings/ctype-mb.c:637:122: warning: this statement may fall through [-Wimplicit-fallthrough=]
/tmp/pkgbuild/databases/mysql57-server/work.sparc64/mysql-5.7.40/strings/ctype-mb.c:637:132: note: here
/tmp/pkgbuild/databases/mysql57-server/work.sparc64/mysql-5.7.40/strings/ctype-mb.c:637:146: warning: this statement may fall through [-Wimplicit-fallthrough=]
/tmp/pkgbuild/databases/mysql57-server/work.sparc64/mysql-5.7.40/strings/ctype-mb.c:637:156: note: here
/tmp/pkgbuild/databases/mysql57-server/work.sparc64/mysql-5.7.40/strings/ctype-mb.c:648:98: warning: this statement may fall through [-Wimplicit-fallthrough=]
/tmp/pkgbuild/databases/mysql57-server/work.sparc64/mysql-5.7.40/strings/ctype-mb.c:648:108: note: here
/tmp/pkgbuild/databases/mysql57-server/work.sparc64/mysql-5.7.40/strings/ctype-mb.c:648:122: warning: this statement may fall through [-Wimplicit-fallthrough=]
/tmp/pkgbuild/databases/mysql57-server/work.sparc64/mysql-5.7.40/strings/ctype-mb.c:648:132: note: here
/tmp/pkgbuild/databases/mysql57-server/work.sparc64/mysql-5.7.40/strings/ctype-mb.c:648:146: warning: this statement may fall through [-Wimplicit-fallthrough=]
/tmp/pkgbuild/databases/mysql57-server/work.sparc64/mysql-5.7.40/strings/ctype-mb.c:648:156: note: here
[  2%] Building CXX object sql/CMakeFiles/gen_lex_hash.dir/gen_lex_hash.cc.o
[  2%] Building C object libservices/CMakeFiles/mysqlservices.dir/service_command.c.o
[  2%] Building C object strings/CMakeFiles/strings.dir/ctype-tis620.c.o
[  2%] Linking CXX executable gen_lex_hash
[  2%] Building C object strings/CMakeFiles/strings.dir/ctype-uca.c.o
[  2%] Building C object libservices/CMakeFiles/mysqlservices.dir/locking_service.c.o
[  2%] Built target gen_lex_hash
[  2%] Building C object libservices/CMakeFiles/mysqlservices.dir/srv_session_service.c.o
[  2%] Building C object strings/CMakeFiles/strings.dir/ctype-ucs2.c.o
[  3%] Building C object libservices/CMakeFiles/mysqlservices.dir/my_snprintf_service.c.o
[  3%] Building C object libservices/CMakeFiles/mysqlservices.dir/thd_alloc_service.c.o
[  3%] Building C object scripts/CMakeFiles/comp_sql.dir/comp_sql.c.o
[  3%] Building C object strings/CMakeFiles/strings.dir/ctype-ujis.c.o
[  3%] Building C object libservices/CMakeFiles/mysqlservices.dir/thd_wait_service.c.o
[  3%] Linking C executable comp_sql
[  3%] Built target comp_sql
[  3%] Building C object libservices/CMakeFiles/mysqlservices.dir/my_plugin_log_service.c.o
[  3%] Building C object strings/CMakeFiles/strings.dir/ctype-utf8.c.o
[  3%] Building C object libservices/CMakeFiles/mysqlservices.dir/my_thread_scheduler_service.c.o
/tmp/pkgbuild/databases/mysql57-server/work.sparc64/mysql-5.7.40/strings/ctype-utf8.c: In function 'my_uni_utf8_no_range':
/tmp/pkgbuild/databases/mysql57-server/work.sparc64/mysql-5.7.40/strings/ctype-utf8.c:5490:65: warning: this statement may fall through [-Wimplicit-fallthrough=]
/tmp/pkgbuild/databases/mysql57-server/work.sparc64/mysql-5.7.40/strings/ctype-utf8.c:5491:5: note: here
/tmp/pkgbuild/databases/mysql57-server/work.sparc64/mysql-5.7.40/strings/ctype-utf8.c:5491:65: warning: this statement may fall through [-Wimplicit-fallthrough=]
/tmp/pkgbuild/databases/mysql57-server/work.sparc64/mysql-5.7.40/strings/ctype-utf8.c:5492:5: note: here
/tmp/pkgbuild/databases/mysql57-server/work.sparc64/mysql-5.7.40/strings/ctype-utf8.c: In function 'my_uni_utf8':
/tmp/pkgbuild/databases/mysql57-server/work.sparc64/mysql-5.7.40/strings/ctype-utf8.c:5462:67: warning: this statement may fall through [-Wimplicit-fallthrough=]
/tmp/pkgbuild/databases/mysql57-server/work.sparc64/mysql-5.7.40/strings/ctype-utf8.c:5463:5: note: here
/tmp/pkgbuild/databases/mysql57-server/work.sparc64/mysql-5.7.40/strings/ctype-utf8.c:5463:67: warning: this statement may fall through [-Wimplicit-fallthrough=]
/tmp/pkgbuild/databases/mysql57-server/work.sparc64/mysql-5.7.40/strings/ctype-utf8.c:5464:5: note: here
/tmp/pkgbuild/databases/mysql57-server/work.sparc64/mysql-5.7.40/strings/ctype-utf8.c: In function 'my_wc_mb_utf8mb4_no_range':
/tmp/pkgbuild/databases/mysql57-server/work.sparc64/mysql-5.7.40/strings/ctype-utf8.c:8042:65: warning: this statement may fall through [-Wimplicit-fallthrough=]
/tmp/pkgbuild/databases/mysql57-server/work.sparc64/mysql-5.7.40/strings/ctype-utf8.c:8043:5: note: here
/tmp/pkgbuild/databases/mysql57-server/work.sparc64/mysql-5.7.40/strings/ctype-utf8.c:8043:65: warning: this statement may fall through [-Wimplicit-fallthrough=]
/tmp/pkgbuild/databases/mysql57-server/work.sparc64/mysql-5.7.40/strings/ctype-utf8.c:8044:5: note: here
/tmp/pkgbuild/databases/mysql57-server/work.sparc64/mysql-5.7.40/strings/ctype-utf8.c:8044:65: warning: this statement may fall through [-Wimplicit-fallthrough=]
/tmp/pkgbuild/databases/mysql57-server/work.sparc64/mysql-5.7.40/strings/ctype-utf8.c:8045:5: note: here
/tmp/pkgbuild/databases/mysql57-server/work.sparc64/mysql-5.7.40/strings/ctype-utf8.c: In function 'my_wc_mb_utf8mb4':
/tmp/pkgbuild/databases/mysql57-server/work.sparc64/mysql-5.7.40/strings/ctype-utf8.c:8011:67: warning: this statement may fall through [-Wimplicit-fallthrough=]
/tmp/pkgbuild/databases/mysql57-server/work.sparc64/mysql-5.7.40/strings/ctype-utf8.c:8012:5: note: here
/tmp/pkgbuild/databases/mysql57-server/work.sparc64/mysql-5.7.40/strings/ctype-utf8.c:8012:67: warning: this statement may fall through [-Wimplicit-fallthrough=]
/tmp/pkgbuild/databases/mysql57-server/work.sparc64/mysql-5.7.40/strings/ctype-utf8.c:8013:5: note: here
/tmp/pkgbuild/databases/mysql57-server/work.sparc64/mysql-5.7.40/strings/ctype-utf8.c:8013:67: warning: this statement may fall through [-Wimplicit-fallthrough=]
/tmp/pkgbuild/databases/mysql57-server/work.sparc64/mysql-5.7.40/strings/ctype-utf8.c:8014:5: note: here
[  3%] Building C object libservices/CMakeFiles/mysqlservices.dir/mysql_string_service.c.o
[  3%] Building CXX object rapid/plugin/group_replication/CMakeFiles/gr_unit_test_resource.dir/src/gcs_plugin_messages.cc.o
[  3%] Building C object strings/CMakeFiles/strings.dir/ctype-win1250ch.c.o
[  3%] Building C object libservices/CMakeFiles/mysqlservices.dir/mysql_malloc_service.c.o
[  3%] Building C object libservices/CMakeFiles/mysqlservices.dir/mysql_password_policy_service.c.o
[  3%] Building C object strings/CMakeFiles/strings.dir/ctype.c.o
[  3%] Building CXX object rapid/plugin/group_replication/CMakeFiles/gr_unit_test_resource.dir/src/member_info.cc.o
[  3%] Building C object strings/CMakeFiles/strings.dir/decimal.c.o
[  3%] Building C object libservices/CMakeFiles/mysqlservices.dir/parser_service.c.o
[  3%] Building C object libservices/CMakeFiles/mysqlservices.dir/srv_session_info_service.c.o
[  3%] Building C object libservices/CMakeFiles/mysqlservices.dir/rpl_transaction_ctx_service.c.o
/tmp/pkgbuild/databases/mysql57-server/work.sparc64/mysql-5.7.40/strings/decimal.c: In function 'count_trailing_zeroes':
/tmp/pkgbuild/databases/mysql57-server/work.sparc64/mysql-5.7.40/strings/decimal.c:276:38: warning: this statement may fall through [-Wimplicit-fallthrough=]
/tmp/pkgbuild/databases/mysql57-server/work.sparc64/mysql-5.7.40/strings/decimal.c:277:3: note: here
/tmp/pkgbuild/databases/mysql57-server/work.sparc64/mysql-5.7.40/strings/decimal.c:277:39: warning: this statement may fall through [-Wimplicit-fallthrough=]
/tmp/pkgbuild/databases/mysql57-server/work.sparc64/mysql-5.7.40/strings/decimal.c:278:3: note: here
/tmp/pkgbuild/databases/mysql57-server/work.sparc64/mysql-5.7.40/strings/decimal.c:278:40: warning: this statement may fall through [-Wimplicit-fallthrough=]
/tmp/pkgbuild/databases/mysql57-server/work.sparc64/mysql-5.7.40/strings/decimal.c:279:3: note: here
/tmp/pkgbuild/databases/mysql57-server/work.sparc64/mysql-5.7.40/strings/decimal.c:279:41: warning: this statement may fall through [-Wimplicit-fallthrough=]
/tmp/pkgbuild/databases/mysql57-server/work.sparc64/mysql-5.7.40/strings/decimal.c:280:3: note: here
/tmp/pkgbuild/databases/mysql57-server/work.sparc64/mysql-5.7.40/strings/decimal.c:280:42: warning: this statement may fall through [-Wimplicit-fallthrough=]
/tmp/pkgbuild/databases/mysql57-server/work.sparc64/mysql-5.7.40/strings/decimal.c:281:3: note: here
/tmp/pkgbuild/databases/mysql57-server/work.sparc64/mysql-5.7.40/strings/decimal.c:281:43: warning: this statement may fall through [-Wimplicit-fallthrough=]
/tmp/pkgbuild/databases/mysql57-server/work.sparc64/mysql-5.7.40/strings/decimal.c:282:3: note: here
/tmp/pkgbuild/databases/mysql57-server/work.sparc64/mysql-5.7.40/strings/decimal.c:282:44: warning: this statement may fall through [-Wimplicit-fallthrough=]
/tmp/pkgbuild/databases/mysql57-server/work.sparc64/mysql-5.7.40/strings/decimal.c:283:3: note: here
/tmp/pkgbuild/databases/mysql57-server/work.sparc64/mysql-5.7.40/strings/decimal.c:283:45: warning: this statement may fall through [-Wimplicit-fallthrough=]
/tmp/pkgbuild/databases/mysql57-server/work.sparc64/mysql-5.7.40/strings/decimal.c:284:3: note: here
/tmp/pkgbuild/databases/mysql57-server/work.sparc64/mysql-5.7.40/strings/decimal.c:284:46: warning: this statement may fall through [-Wimplicit-fallthrough=]
/tmp/pkgbuild/databases/mysql57-server/work.sparc64/mysql-5.7.40/strings/decimal.c:285:3: note: here
/tmp/pkgbuild/databases/mysql57-server/work.sparc64/mysql-5.7.40/strings/decimal.c: In function 'count_leading_zeroes':
/tmp/pkgbuild/databases/mysql57-server/work.sparc64/mysql-5.7.40/strings/decimal.c:243:41: warning: this statement may fall through [-Wimplicit-fallthrough=]
/tmp/pkgbuild/databases/mysql57-server/work.sparc64/mysql-5.7.40/strings/decimal.c:244:3: note: here
/tmp/pkgbuild/databases/mysql57-server/work.sparc64/mysql-5.7.40/strings/decimal.c:244:40: warning: this statement may fall through [-Wimplicit-fallthrough=]
/tmp/pkgbuild/databases/mysql57-server/work.sparc64/mysql-5.7.40/strings/decimal.c:245:3: note: here
/tmp/pkgbuild/databases/mysql57-server/work.sparc64/mysql-5.7.40/strings/decimal.c:245:39: warning: this statement may fall through [-Wimplicit-fallthrough=]
/tmp/pkgbuild/databases/mysql57-server/work.sparc64/mysql-5.7.40/strings/decimal.c:246:3: note: here
/tmp/pkgbuild/databases/mysql57-server/work.sparc64/mysql-5.7.40/strings/decimal.c:246:38: warning: this statement may fall through [-Wimplicit-fallthrough=]
/tmp/pkgbuild/databases/mysql57-server/work.sparc64/mysql-5.7.40/strings/decimal.c:247:3: note: here
/tmp/pkgbuild/databases/mysql57-server/work.sparc64/mysql-5.7.40/strings/decimal.c:247:37: warning: this statement may fall through [-Wimplicit-fallthrough=]
/tmp/pkgbuild/databases/mysql57-server/work.sparc64/mysql-5.7.40/strings/decimal.c:248:3: note: here
/tmp/pkgbuild/databases/mysql57-server/work.sparc64/mysql-5.7.40/strings/decimal.c:248:36: warning: this statement may fall through [-Wimplicit-fallthrough=]
/tmp/pkgbuild/databases/mysql57-server/work.sparc64/mysql-5.7.40/strings/decimal.c:249:3: note: here
/tmp/pkgbuild/databases/mysql57-server/work.sparc64/mysql-5.7.40/strings/decimal.c:249:35: warning: this statement may fall through [-Wimplicit-fallthrough=]
/tmp/pkgbuild/databases/mysql57-server/work.sparc64/mysql-5.7.40/strings/decimal.c:250:3: note: here
/tmp/pkgbuild/databases/mysql57-server/work.sparc64/mysql-5.7.40/strings/decimal.c:250:34: warning: this statement may fall through [-Wimplicit-fallthrough=]
/tmp/pkgbuild/databases/mysql57-server/work.sparc64/mysql-5.7.40/strings/decimal.c:251:3: note: here
/tmp/pkgbuild/databases/mysql57-server/work.sparc64/mysql-5.7.40/strings/decimal.c:251:33: warning: this statement may fall through [-Wimplicit-fallthrough=]
/tmp/pkgbuild/databases/mysql57-server/work.sparc64/mysql-5.7.40/strings/decimal.c:252:3: note: here
[  3%] Building C object strings/CMakeFiles/strings.dir/dtoa.c.o
[  3%] Building CXX object rapid/plugin/group_replication/CMakeFiles/gr_unit_test_resource.dir/src/member_version.cc.o
[  3%] Building C object libservices/CMakeFiles/mysqlservices.dir/rpl_transaction_write_set_service.c.o
[  3%] Building C object libservices/CMakeFiles/mysqlservices.dir/security_context_service.c.o
/tmp/pkgbuild/databases/mysql57-server/work.sparc64/mysql-5.7.40/strings/dtoa.c: In function 'dtoa':
/tmp/pkgbuild/databases/mysql57-server/work.sparc64/mysql-5.7.40/strings/dtoa.c:2325:14: warning: this statement may fall through [-Wimplicit-fallthrough=]
/tmp/pkgbuild/databases/mysql57-server/work.sparc64/mysql-5.7.40/strings/dtoa.c:2327:3: note: here
/tmp/pkgbuild/databases/mysql57-server/work.sparc64/mysql-5.7.40/strings/dtoa.c:2333:14: warning: this statement may fall through [-Wimplicit-fallthrough=]
/tmp/pkgbuild/databases/mysql57-server/work.sparc64/mysql-5.7.40/strings/dtoa.c:2335:3: note: here
/tmp/pkgbuild/databases/mysql57-server/work.sparc64/mysql-5.7.40/strings/dtoa.c: In function 'my_strtod_int':
/tmp/pkgbuild/databases/mysql57-server/work.sparc64/mysql-5.7.40/strings/dtoa.c:1380:11: warning: this statement may fall through [-Wimplicit-fallthrough=]
/tmp/pkgbuild/databases/mysql57-server/work.sparc64/mysql-5.7.40/strings/dtoa.c:1382:5: note: here
/tmp/pkgbuild/databases/mysql57-server/work.sparc64/mysql-5.7.40/strings/dtoa.c:1477:14: warning: this statement may fall through [-Wimplicit-fallthrough=]
/tmp/pkgbuild/databases/mysql57-server/work.sparc64/mysql-5.7.40/strings/dtoa.c:1479:7: note: here
[  3%] Building C object strings/CMakeFiles/strings.dir/int2str.c.o
[  3%] Building CXX object rapid/plugin/group_replication/CMakeFiles/gr_unit_test_resource.dir/src/compatibility_module.cc.o
[  4%] Building C object strings/CMakeFiles/strings.dir/is_prefix.c.o
[  4%] Building C object libservices/CMakeFiles/mysqlservices.dir/mysql_keyring_service.c.o
[  4%] Building C object strings/CMakeFiles/strings.dir/llstr.c.o
[  4%] Building CXX object rapid/plugin/group_replication/CMakeFiles/gr_unit_test_resource.dir/libmysqlgcs/src/interface/gcs_logging.cc.o
[  4%] Linking C static library ../archive_output_directory/libmysqlservices.a
[  4%] Building C object strings/CMakeFiles/strings.dir/longlong2str.c.o
[  4%] Building C object strings/CMakeFiles/strings.dir/my_strtoll10.c.o
[  4%] Built target mysqlservices
[  4%] Building C object strings/CMakeFiles/strings.dir/my_vsnprintf.c.o
[  4%] Building CXX object rapid/plugin/group_replication/CMakeFiles/gr_unit_test_resource.dir/libmysqlgcs/src/interface/xplatform/my_xp_cond.cc.o
[  4%] Building CXX object rapid/plugin/group_replication/CMakeFiles/gr_unit_test_resource.dir/libmysqlgcs/src/interface/xplatform/my_xp_thread.cc.o
[  4%] Building C object strings/CMakeFiles/strings.dir/str2int.c.o
[  4%] Building C object strings/CMakeFiles/strings.dir/str_alloc.c.o
[  4%] Building CXX object rapid/plugin/group_replication/CMakeFiles/gr_unit_test_resource.dir/libmysqlgcs/src/interface/xplatform/my_xp_mutex.cc.o
[  4%] Building CXX object rapid/plugin/group_replication/CMakeFiles/gr_unit_test_resource.dir/libmysqlgcs/src/interface/xplatform/my_xp_util.cc.o
[  4%] Generating generated/protobuf_lite/mysqlx.proto
[  4%] Generating generated/protobuf_lite/mysqlx_datatypes.proto
[  4%] Building C object strings/CMakeFiles/strings.dir/strcend.c.o
[  4%] Generating generated/protobuf_lite/mysqlx_connection.proto
[  4%] Building CXX object rapid/plugin/group_replication/CMakeFiles/gr_unit_test_resource.dir/libmysqlgcs/src/interface/gcs_view.cc.o
[  4%] Building C object strings/CMakeFiles/strings.dir/strend.c.o
[  4%] Generating generated/protobuf_lite/mysqlx_expect.proto
[  4%] Building C object strings/CMakeFiles/strings.dir/strfill.c.o
[  4%] Generating generated/protobuf_lite/mysqlx_expr.proto
[  4%] Building CXX object rapid/plugin/group_replication/CMakeFiles/gr_unit_test_resource.dir/libmysqlgcs/src/interface/gcs_types.cc.o
[  4%] Building C object strings/CMakeFiles/strings.dir/strmake.c.o
[  4%] Generating generated/protobuf_lite/mysqlx_crud.proto
[  4%] Building C object strings/CMakeFiles/strings.dir/my_stpmov.c.o
[  4%] Generating generated/protobuf_lite/mysqlx_sql.proto
[  4%] Building CXX object rapid/plugin/group_replication/CMakeFiles/gr_unit_test_resource.dir/libmysqlgcs/src/interface/gcs_message.cc.o
[  4%] Building C object strings/CMakeFiles/strings.dir/my_stpnmov.c.o
[  4%] Generating generated/protobuf_lite/mysqlx_session.proto
[  4%] Building C object strings/CMakeFiles/strings.dir/strxmov.c.o
[  4%] Generating generated/protobuf_lite/mysqlx_notice.proto
[  4%] Generating generated/protobuf_lite/mysqlx_resultset.proto
[  4%] Built target GenLiteProtos
[  4%] Building C object strings/CMakeFiles/strings.dir/strxnmov.c.o
[  4%] Building CXX object rapid/plugin/group_replication/CMakeFiles/gr_unit_test_resource.dir/libmysqlgcs/src/interface/gcs_member_identifier.cc.o
[  4%] Building C object strings/CMakeFiles/strings.dir/xml.c.o
[  4%] Building CXX object extra/protobuf/CMakeFiles/protobuf-lite.dir/protobuf-2.6.1/src/google/protobuf/stubs/atomicops_internals_x86_gcc.cc.o
[  4%] Building C object strings/CMakeFiles/strings.dir/my_strchr.c.o
[  4%] Building CXX object rapid/plugin/group_replication/CMakeFiles/gr_unit_test_resource.dir/libmysqlgcs/src/interface/gcs_group_identifier.cc.o
distcc[26591] ERROR: compile /tmp/pkgbuild/databases/mysql57-server/work.sparc64/mysql-5.7.40/extra/protobuf/protobuf-2.6.1/src/google/protobuf/stubs/atomicops_internals_x86_gcc.cc on 10.1.1.1:3642 failed
distcc[26591] (dcc_build_somewhere) Warning: remote compilation of '/tmp/pkgbuild/databases/mysql57-server/work.sparc64/mysql-5.7.40/extra/protobuf/protobuf-2.6.1/src/google/protobuf/stubs/atomicops_internals_x86_gcc.cc' failed, retrying locally
distcc[26591] Warning: failed to distribute /tmp/pkgbuild/databases/mysql57-server/work.sparc64/mysql-5.7.40/extra/protobuf/protobuf-2.6.1/src/google/protobuf/stubs/atomicops_internals_x86_gcc.cc to 10.1.1.1:3642, running locally instead
distcc[1489] (dcc_build_somewhere) Warning: failed to distribute, running locally instead
[  4%] Building C object strings/CMakeFiles/strings.dir/strcont.c.o
[  4%] Building C object strings/CMakeFiles/strings.dir/strappend.c.o
In file included from /tmp/pkgbuild/databases/mysql57-server/work.sparc64/mysql-5.7.40/extra/protobuf/protobuf-2.6.1/src/google/protobuf/stubs/atomicops.h:201:0,
                 from /tmp/pkgbuild/databases/mysql57-server/work.sparc64/mysql-5.7.40/extra/protobuf/protobuf-2.6.1/src/google/protobuf/stubs/atomicops_internals_x86_gcc.cc:36:
/tmp/pkgbuild/databases/mysql57-server/work.sparc64/mysql-5.7.40/extra/protobuf/protobuf-2.6.1/src/google/protobuf/stubs/atomicops_internals_generic_gcc.h:107:36: error: 'Atomic64' does not name a type; did you mean 'Atomic32'?
 inline void Release_Store(volatile Atomic64* ptr, Atomic64 value) {
                                    ^~~~~~~~
                                    Atomic32
/tmp/pkgbuild/databases/mysql57-server/work.sparc64/mysql-5.7.40/extra/protobuf/protobuf-2.6.1/src/google/protobuf/stubs/atomicops_internals_generic_gcc.h:107:51: error: 'Atomic64' has not been declared
 inline void Release_Store(volatile Atomic64* ptr, Atomic64 value) {
                                                   ^~~~~~~~
/tmp/pkgbuild/databases/mysql57-server/work.sparc64/mysql-5.7.40/extra/protobuf/protobuf-2.6.1/src/google/protobuf/stubs/atomicops_internals_generic_gcc.h: In function 'void google::protobuf::internal::Release_Store(volatile int*, int)':
/tmp/pkgbuild/databases/mysql57-server/work.sparc64/mysql-5.7.40/extra/protobuf/protobuf-2.6.1/src/google/protobuf/stubs/atomicops_internals_generic_gcc.h:107:13: error: redefinition of 'void google::protobuf::internal::Release_Store(volatile int*, int)'
 inline void Release_Store(volatile Atomic64* ptr, Atomic64 value) {
             ^~~~~~~~~~~~~
/tmp/pkgbuild/databases/mysql57-server/work.sparc64/mysql-5.7.40/extra/protobuf/protobuf-2.6.1/src/google/protobuf/stubs/atomicops_internals_generic_gcc.h:89:13: note: 'void google::protobuf::internal::Release_Store(volatile Atomic32*, google::protobuf::internal::Atomic32)' previously defined here
 inline void Release_Store(volatile Atomic32* ptr, Atomic32 value) {
             ^~~~~~~~~~~~~
/tmp/pkgbuild/databases/mysql57-server/work.sparc64/mysql-5.7.40/extra/protobuf/protobuf-2.6.1/src/google/protobuf/stubs/atomicops_internals_generic_gcc.h: At global scope:
/tmp/pkgbuild/databases/mysql57-server/work.sparc64/mysql-5.7.40/extra/protobuf/protobuf-2.6.1/src/google/protobuf/stubs/atomicops_internals_generic_gcc.h:111:8: error: 'Atomic64' does not name a type; did you mean 'Atomic32'?
 inline Atomic64 Acquire_Load(volatile const Atomic64* ptr) {
        ^~~~~~~~
        Atomic32
/tmp/pkgbuild/databases/mysql57-server/work.sparc64/mysql-5.7.40/extra/protobuf/protobuf-2.6.1/src/google/protobuf/stubs/atomicops_internals_generic_gcc.h:115:8: error: 'Atomic64' does not name a type; did you mean 'Atomic32'?
 inline Atomic64 Acquire_CompareAndSwap(volatile Atomic64* ptr,
        ^~~~~~~~
        Atomic32
/tmp/pkgbuild/databases/mysql57-server/work.sparc64/mysql-5.7.40/extra/protobuf/protobuf-2.6.1/src/google/protobuf/stubs/atomicops_internals_generic_gcc.h:123:8: error: 'Atomic64' does not name a type; did you mean 'Atomic32'?
 inline Atomic64 NoBarrier_CompareAndSwap(volatile Atomic64* ptr,
        ^~~~~~~~
        Atomic32
[  4%] Linking C static library ../archive_output_directory/libstrings.a
distcc[26591] ERROR: compile /tmp/pkgbuild/databases/mysql57-server/work.sparc64/mysql-5.7.40/extra/protobuf/protobuf-2.6.1/src/google/protobuf/stubs/atomicops_internals_x86_gcc.cc on localhost failed
gmake[2]: *** [extra/protobuf/CMakeFiles/protobuf-lite.dir/build.make:76: extra/protobuf/CMakeFiles/protobuf-lite.dir/protobuf-2.6.1/src/google/protobuf/stubs/atomicops_internals_x86_gcc.cc.o] Error 1
gmake[1]: *** [CMakeFiles/Makefile2:1747: extra/protobuf/CMakeFiles/protobuf-lite.dir/all] Error 2
gmake[1]: *** Waiting for unfinished jobs....
[  4%] Linking CXX static library ../../../archive_output_directory/libgr_unit_test_resource.a
[  4%] Built target strings
[  4%] Built target gr_unit_test_resource
gmake: *** [Makefile:166: all] Error 2
*** Error code 2

Stop.
make[1]: stopped in /usr/pkgsrc/databases/mysql57-server
*** Error code 1

Stop.
make: stopped in /usr/pkgsrc/databases/mysql57-server