=> Bootstrap dependency digest>=20211023: found digest-20220214
===> Skipping vulnerability checks.
WARNING: No /usr/pkg/pkgdb/pkg-vulnerabilities file found.
WARNING: To fix run: `/usr/sbin/pkg_admin -K /usr/pkg/pkgdb fetch-pkg-vulnerabilities'.
===> Building for openrct2-0.2.4nb21
[  0%] Building CXX object CMakeFiles/libopenrct2.dir/src/openrct2/Cheats.cpp.o
[  0%] Building CXX object CMakeFiles/libopenrct2.dir/src/openrct2/CmdlineSprite.cpp.o
[  0%] Building CXX object CMakeFiles/libopenrct2.dir/src/openrct2/Context.cpp.o
In file included from /tmp/pkgbuild/games/openrct2/work.sparc64/OpenRCT2-0.2.4/src/openrct2/Context.cpp:26:0:
/tmp/pkgbuild/games/openrct2/work.sparc64/OpenRCT2-0.2.4/src/openrct2/Version.h:43:6: error: #error "OPENRCT2_ARCHITECTURE is undefined. Please add identification."
 #    error "OPENRCT2_ARCHITECTURE is undefined. Please add identification."
      ^~~~~
distcc[29173] ERROR: compile /tmp/pkgbuild/games/openrct2/work.sparc64/OpenRCT2-0.2.4/src/openrct2/Context.cpp on 10.1.1.1:3642 failed
distcc[29173] (dcc_build_somewhere) Warning: remote compilation of '/tmp/pkgbuild/games/openrct2/work.sparc64/OpenRCT2-0.2.4/src/openrct2/Context.cpp' failed, retrying locally
distcc[29173] Warning: failed to distribute /tmp/pkgbuild/games/openrct2/work.sparc64/OpenRCT2-0.2.4/src/openrct2/Context.cpp to 10.1.1.1:3642, running locally instead
[  1%] Building CXX object CMakeFiles/libopenrct2.dir/src/openrct2/Date.cpp.o
In file included from /tmp/pkgbuild/games/openrct2/work.sparc64/OpenRCT2-0.2.4/src/openrct2/Context.cpp:26:0:
/tmp/pkgbuild/games/openrct2/work.sparc64/OpenRCT2-0.2.4/src/openrct2/Version.h:43:6: error: #error "OPENRCT2_ARCHITECTURE is undefined. Please add identification."
 #    error "OPENRCT2_ARCHITECTURE is undefined. Please add identification."
      ^~~~~
[  1%] Building CXX object CMakeFiles/libopenrct2.dir/src/openrct2/Diagnostic.cpp.o
[  1%] Building CXX object CMakeFiles/libopenrct2.dir/src/openrct2/Editor.cpp.o
[  1%] Building CXX object CMakeFiles/libopenrct2.dir/src/openrct2/EditorObjectSelectionSession.cpp.o
[  2%] Building CXX object CMakeFiles/libopenrct2.dir/src/openrct2/FileClassifier.cpp.o
[  2%] Building CXX object CMakeFiles/libopenrct2.dir/src/openrct2/Game.cpp.o
[  2%] Building CXX object CMakeFiles/libopenrct2.dir/src/openrct2/GameState.cpp.o
[  2%] Building CXX object CMakeFiles/libopenrct2.dir/src/openrct2/GameStateSnapshots.cpp.o
[  3%] Building CXX object CMakeFiles/libopenrct2.dir/src/openrct2/Input.cpp.o
[  3%] Building CXX object CMakeFiles/libopenrct2.dir/src/openrct2/Intro.cpp.o
[  3%] Building CXX object CMakeFiles/libopenrct2.dir/src/openrct2/OpenRCT2.cpp.o
[  4%] Building CXX object CMakeFiles/libopenrct2.dir/src/openrct2/PlatformEnvironment.cpp.o
[  4%] Building CXX object CMakeFiles/libopenrct2.dir/src/openrct2/ParkImporter.cpp.o
[  4%] Building CXX object CMakeFiles/libopenrct2.dir/src/openrct2/ReplayManager.cpp.o
[  4%] Building CXX object CMakeFiles/libopenrct2.dir/src/openrct2/TrackImporter.cpp.o
[  4%] Building CXX object CMakeFiles/libopenrct2.dir/src/openrct2/Version.cpp.o
In file included from /tmp/pkgbuild/games/openrct2/work.sparc64/OpenRCT2-0.2.4/src/openrct2/Version.cpp:10:0:
/tmp/pkgbuild/games/openrct2/work.sparc64/OpenRCT2-0.2.4/src/openrct2/Version.h:43:6: error: #error "OPENRCT2_ARCHITECTURE is undefined. Please add identification."
 #    error "OPENRCT2_ARCHITECTURE is undefined. Please add identification."
      ^~~~~
distcc[18394] ERROR: compile /tmp/pkgbuild/games/openrct2/work.sparc64/OpenRCT2-0.2.4/src/openrct2/Version.cpp on 10.1.1.1:3642 failed
distcc[18394] (dcc_build_somewhere) Warning: remote compilation of '/tmp/pkgbuild/games/openrct2/work.sparc64/OpenRCT2-0.2.4/src/openrct2/Version.cpp' failed, retrying locally
distcc[18394] Warning: failed to distribute /tmp/pkgbuild/games/openrct2/work.sparc64/OpenRCT2-0.2.4/src/openrct2/Version.cpp to 10.1.1.1:3642, running locally instead
In file included from /tmp/pkgbuild/games/openrct2/work.sparc64/OpenRCT2-0.2.4/src/openrct2/Version.cpp:10:0:
/tmp/pkgbuild/games/openrct2/work.sparc64/OpenRCT2-0.2.4/src/openrct2/Version.h:43:6: error: #error "OPENRCT2_ARCHITECTURE is undefined. Please add identification."
 #    error "OPENRCT2_ARCHITECTURE is undefined. Please add identification."
      ^~~~~
distcc[18394] ERROR: compile /tmp/pkgbuild/games/openrct2/work.sparc64/OpenRCT2-0.2.4/src/openrct2/Version.cpp on localhost failed
--- CMakeFiles/libopenrct2.dir/src/openrct2/Version.cpp.o ---
*** [CMakeFiles/libopenrct2.dir/src/openrct2/Version.cpp.o] Error code 1

make[2]: stopped in /tmp/pkgbuild/games/openrct2/work.sparc64/OpenRCT2-0.2.4/build
distcc[29173] ERROR: compile /tmp/pkgbuild/games/openrct2/work.sparc64/OpenRCT2-0.2.4/src/openrct2/Context.cpp on localhost failed
--- CMakeFiles/libopenrct2.dir/src/openrct2/Context.cpp.o ---
*** [CMakeFiles/libopenrct2.dir/src/openrct2/Context.cpp.o] Error code 1

make[2]: stopped in /tmp/pkgbuild/games/openrct2/work.sparc64/OpenRCT2-0.2.4/build
2 errors

make[2]: stopped in /tmp/pkgbuild/games/openrct2/work.sparc64/OpenRCT2-0.2.4/build
--- CMakeFiles/libopenrct2.dir/all ---
*** [CMakeFiles/libopenrct2.dir/all] Error code 2

make[1]: stopped in /tmp/pkgbuild/games/openrct2/work.sparc64/OpenRCT2-0.2.4/build
1 error

make[1]: stopped in /tmp/pkgbuild/games/openrct2/work.sparc64/OpenRCT2-0.2.4/build
*** [all] Error code 2

make: stopped in /tmp/pkgbuild/games/openrct2/work.sparc64/OpenRCT2-0.2.4/build
1 error

make: stopped in /tmp/pkgbuild/games/openrct2/work.sparc64/OpenRCT2-0.2.4/build
*** Error code 2

Stop.
make[1]: stopped in /usr/pkgsrc/games/openrct2
*** Error code 1

Stop.
make: stopped in /usr/pkgsrc/games/openrct2