=> Bootstrap dependency digest>=20211023: found digest-20220214
===> Skipping vulnerability checks.
WARNING: No /usr/pkg/pkgdb/pkg-vulnerabilities file found.
WARNING: To fix run: `/usr/sbin/pkg_admin -K /usr/pkg/pkgdb fetch-pkg-vulnerabilities'.
===> Building for nodejs-18.12.1nb1
/usr/pkg/bin/gmake -C out BUILDTYPE=Release V=0
  touch /tmp/pkgbuild/lang/nodejs18/work.alpha/node-v18.12.1/out/Release/obj.target/deps/googletest/gtest_prod.stamp
  touch /tmp/pkgbuild/lang/nodejs18/work.alpha/node-v18.12.1/out/Release/obj.target/tools/icu/icui18n.stamp
  touch /tmp/pkgbuild/lang/nodejs18/work.alpha/node-v18.12.1/out/Release/obj.target/tools/icu/icuuc.stamp
  gcc -o /tmp/pkgbuild/lang/nodejs18/work.alpha/node-v18.12.1/out/Release/obj.target/base64/deps/base64/base64/lib/arch/generic/codec.o ../deps/base64/base64/lib/arch/generic/codec.c '-DV8_DEPRECATION_WARNINGS' '-DV8_IMMINENT_DEPRECATION_WARNINGS' '-D_GLIBCXX_USE_CXX11_ABI=1' '-DNODE_OPENSSL_CONF_NAME=nodejs_conf' '-D__STDC_FORMAT_MACROS' '-DBASE64_STATIC_DEFINE' '-DHAVE_SSSE3=1' '-DHAVE_SSE41=1' '-DHAVE_SSE42=1' '-DHAVE_AVX=1' '-DHAVE_AVX2=1' -I/usr/pkg/include -I../deps/base64/base64/include -I../deps/base64/base64/lib  -pthread -Wall -Wextra -Wno-unused-parameter -m32 -O3 -fno-omit-frame-pointer  -MMD -MF /tmp/pkgbuild/lang/nodejs18/work.alpha/node-v18.12.1/out/Release/.deps//tmp/pkgbuild/lang/nodejs18/work.alpha/node-v18.12.1/out/Release/obj.target/base64/deps/base64/base64/lib/arch/generic/codec.o.d.raw -I/usr/include -I/usr/pkg/include -I/usr/pkg/include/python3.10 -O2 -mieee -D_FORTIFY_SOURCE=2 -pthread -I/usr/include -I/usr/pkg/include -I/usr/pkg/include/python3.10 -c
gcc: error: unrecognized command line option '-m32'
gmake[1]: *** [deps/base64/base64.target.mk:102: /tmp/pkgbuild/lang/nodejs18/work.alpha/node-v18.12.1/out/Release/obj.target/base64/deps/base64/base64/lib/arch/generic/codec.o] Error 1
gmake[1]: *** Waiting for unfinished jobs....
  gcc -o /tmp/pkgbuild/lang/nodejs18/work.alpha/node-v18.12.1/out/Release/obj.target/base64/deps/base64/base64/lib/tables/tables.o ../deps/base64/base64/lib/tables/tables.c '-DV8_DEPRECATION_WARNINGS' '-DV8_IMMINENT_DEPRECATION_WARNINGS' '-D_GLIBCXX_USE_CXX11_ABI=1' '-DNODE_OPENSSL_CONF_NAME=nodejs_conf' '-D__STDC_FORMAT_MACROS' '-DBASE64_STATIC_DEFINE' '-DHAVE_SSSE3=1' '-DHAVE_SSE41=1' '-DHAVE_SSE42=1' '-DHAVE_AVX=1' '-DHAVE_AVX2=1' -I/usr/pkg/include -I../deps/base64/base64/include -I../deps/base64/base64/lib  -pthread -Wall -Wextra -Wno-unused-parameter -m32 -O3 -fno-omit-frame-pointer  -MMD -MF /tmp/pkgbuild/lang/nodejs18/work.alpha/node-v18.12.1/out/Release/.deps//tmp/pkgbuild/lang/nodejs18/work.alpha/node-v18.12.1/out/Release/obj.target/base64/deps/base64/base64/lib/tables/tables.o.d.raw -I/usr/include -I/usr/pkg/include -I/usr/pkg/include/python3.10 -O2 -mieee -D_FORTIFY_SOURCE=2 -pthread -I/usr/include -I/usr/pkg/include -I/usr/pkg/include/python3.10 -c
gcc: error: unrecognized command line option '-m32'
gmake[1]: *** [deps/base64/base64.target.mk:102: /tmp/pkgbuild/lang/nodejs18/work.alpha/node-v18.12.1/out/Release/obj.target/base64/deps/base64/base64/lib/tables/tables.o] Error 1
gmake: *** [Makefile:134: node] Error 2
*** Error code 2

Stop.
make[1]: stopped in /usr/pkgsrc/lang/nodejs18
*** Error code 1

Stop.
make: stopped in /usr/pkgsrc/lang/nodejs18